build checks.x86_64-linux.jsonld

Queued Started Finished

Reproduce this run
Retry Run
  1. 0.00 s $ /nix/store/9ypz3flqsrl5xl495mm8h645gadjsxi1-coreutils-9.11/bin/timeout --kill-after=15s 7200s /nix/store/23zk8sgzamrbmj1fday15szf7f2279s8-nix-2.34.7/bin/nix --extra-experimental-features nix-command --extra-experimental-features flakes --log-format internal-json build --no-link --print-out-paths git+https://github.com/NorfairKing/schema-dot-org?ref=master&rev=19e6b8817e7bec4930f841e0efbadd872c7ae8f6&shallow=1#checks.x86_64-linux.jsonld --print-build-logs
  2. 0.11 s fetching Git repository 'https://github.com/NorfairKing/schema-dot-org'
  3. 0.80 s remote: Enumerating objects: 94, done.
  4. 0.80 s remote: Counting objects: 1% (1/94) remote: Counting objects: 2% (2/94) remote: Counting objects: 3% (3/94) remote: Counting objects: 4% (4/94) remote: Counting objects: 5% (5/94) remote: Counting objects: 6% (6/94) remote: Counting objects: 7% (7/94) remote: Counting objects: 8% (8/94) remote: Counting objects: 9% (9/94) remote: Counting objects: 10% (10/94) remote: Counting objects: 11% (11/94) remote: Counting objects: 12% (12/94) remote: Counting objects: 13% (13/94) remote: Counting objects: 14% (14/94) remote: Counting objects: 15% (15/94) remote: Counting objects: 17% (16/94) remote: Counting objects: 18% (17/94) remote: Counting objects: 19% (18/94) remote: Counting objects: 20% (19/94) remote: Counting objects: 21% (20/94) remote: Counting objects: 22% (21/94) remote: Counting objects: 23% (22/94) remote: Counting objects: 24% (23/94) remote: Counting objects: 25% (24/94) remote: Counting objects: 26% (25/94) remote: Counting objects: 27% (26/94) remote: Counting objects: 28% (27/94) remote: Counting objects: 29% (28/94) remote: Counting objects: 30% (29/94) remote: Counting objects: 31% (30/94) remote: Counting objects: 32% (31/94) remote: Counting objects: 34% (32/94) remote: Counting objects: 35% (33/94) remote: Counting objects: 36% (34/94) remote: Counting objects: 37% (35/94) remote: Counting objects: 38% (36/94) remote: Counting objects: 39% (37/94) remote: Counting objects: 40% (38/94) remote: Counting objects: 41% (39/94) remote: Counting objects: 42% (40/94) remote: Counting objects: 43% (41/94) remote: Counting objects: 44% (42/94) remote: Counting objects: 45% (43/94) remote: Counting objects: 46% (44/94) remote: Counting objects: 47% (45/94) remote: Counting objects: 48% (46/94) remote: Counting objects: 50% (47/94) remote: Counting objects: 51% (48/94) remote: Counting objects: 52% (49/94) remote: Counting objects: 53% (50/94) remote: Counting objects: 54% (51/94) remote: Counting objects: 55% (52/94) remote: Counting objects: 56% (53/94) remote: Counting objects: 57% (54/94) remote: Counting objects: 58% (55/94) remote: Counting objects: 59% (56/94) remote: Counting objects: 60% (57/94) remote: Counting objects: 61% (58/94) remote: Counting objects: 62% (59/94) remote: Counting objects: 63% (60/94) remote: Counting objects: 64% (61/94) remote: Counting objects: 65% (62/94) remote: Counting objects: 67% (63/94) remote: Counting objects: 68% (64/94) remote: Counting objects: 69% (65/94) remote: Counting objects: 70% (66/94) remote: Counting objects: 71% (67/94) remote: Counting objects: 72% (68/94) remote: Counting objects: 73% (69/94) remote: Counting objects: 74% (70/94) remote: Counting objects: 75% (71/94) remote: Counting objects: 76% (72/94) remote: Counting objects: 77% (73/94) remote: Counting objects: 78% (74/94) remote: Counting objects: 79% (75/94) remote: Counting objects: 80% (76/94) remote: Counting objects: 81% (77/94) remote: Counting objects: 82% (78/94) remote: Counting objects: 84% (79/94) remote: Counting objects: 85% (80/94) remote: Counting objects: 86% (81/94) remote: Counting objects: 87% (82/94) remote: Counting objects: 88% (83/94) remote: Counting objects: 89% (84/94) remote: Counting objects: 90% (85/94) remote: Counting objects: 91% (86/94) remote: Counting objects: 92% (87/94) remote: Counting objects: 93% (88/94) remote: Counting objects: 94% (89/94) remote: Counting objects: 95% (90/94) remote: Counting objects: 96% (91/94) remote: Counting objects: 97% (92/94) remote: Counting objects: 98% (93/94) remote: Counting objects: 100% (94/94) remote: Counting objects: 100% (94/94), done.
  5. 0.80 s remote: Compressing objects: 1% (1/78) remote: Compressing objects: 2% (2/78) remote: Compressing objects: 3% (3/78) remote: Compressing objects: 5% (4/78) remote: Compressing objects: 6% (5/78) remote: Compressing objects: 7% (6/78) remote: Compressing objects: 8% (7/78) remote: Compressing objects: 10% (8/78) remote: Compressing objects: 11% (9/78) remote: Compressing objects: 12% (10/78) remote: Compressing objects: 14% (11/78) remote: Compressing objects: 15% (12/78) remote: Compressing objects: 16% (13/78) remote: Compressing objects: 17% (14/78) remote: Compressing objects: 19% (15/78) remote: Compressing objects: 20% (16/78) remote: Compressing objects: 21% (17/78) remote: Compressing objects: 23% (18/78) remote: Compressing objects: 24% (19/78) remote: Compressing objects: 25% (20/78) remote: Compressing objects: 26% (21/78) remote: Compressing objects: 28% (22/78) remote: Compressing objects: 29% (23/78) remote: Compressing objects: 30% (24/78) remote: Compressing objects: 32% (25/78) remote: Compressing objects: 33% (26/78) remote: Compressing objects: 34% (27/78) remote: Compressing objects: 35% (28/78) remote: Compressing objects: 37% (29/78) remote: Compressing objects: 38% (30/78) remote: Compressing objects: 39% (31/78) remote: Compressing objects: 41% (32/78) remote: Compressing objects: 42% (33/78) remote: Compressing objects: 43% (34/78) remote: Compressing objects: 44% (35/78) remote: Compressing objects: 46% (36/78) remote: Compressing objects: 47% (37/78) remote: Compressing objects: 48% (38/78) remote: Compressing objects: 50% (39/78) remote: Compressing objects: 51% (40/78) remote: Compressing objects: 52% (41/78) remote: Compressing objects: 53% (42/78) remote: Compressing objects: 55% (43/78) remote: Compressing objects: 56% (44/78) remote: Compressing objects: 57% (45/78) remote: Compressing objects: 58% (46/78) remote: Compressing objects: 60% (47/78) remote: Compressing objects: 61% (48/78) remote: Compressing objects: 62% (49/78) remote: Compressing objects: 64% (50/78) remote: Compressing objects: 65% (51/78) remote: Compressing objects: 66% (52/78) remote: Compressing objects: 67% (53/78) remote: Compressing objects: 69% (54/78) remote: Compressing objects: 70% (55/78) remote: Compressing objects: 71% (56/78) remote: Compressing objects: 73% (57/78) remote: Compressing objects: 74% (58/78) remote: Compressing objects: 75% (59/78) remote: Compressing objects: 76% (60/78) remote: Compressing objects: 78% (61/78) remote: Compressing objects: 79% (62/78) remote: Compressing objects: 80% (63/78) remote: Compressing objects: 82% (64/78) remote: Compressing objects: 83% (65/78) remote: Compressing objects: 84% (66/78) remote: Compressing objects: 85% (67/78) remote: Compressing objects: 87% (68/78) remote: Compressing objects: 88% (69/78) remote: Compressing objects: 89% (70/78) remote: Compressing objects: 91% (71/78) remote: Compressing objects: 92% (72/78) remote: Compressing objects: 93% (73/78) remote: Compressing objects: 94% (74/78) remote: Compressing objects: 96% (75/78) remote: Compressing objects: 97% (76/78) remote: Compressing objects: 98% (77/78) remote: Compressing objects: 100% (78/78) remote: Compressing objects: 100% (78/78), done.
  6. 0.83 s Unpacking objects: 1% (1/94) Unpacking objects: 2% (2/94) Unpacking objects: 3% (3/94) Unpacking objects: 4% (4/94) Unpacking objects: 5% (5/94) Unpacking objects: 6% (6/94) Unpacking objects: 7% (7/94) Unpacking objects: 8% (8/94) Unpacking objects: 9% (9/94) Unpacking objects: 10% (10/94) Unpacking objects: 11% (11/94) Unpacking objects: 12% (12/94) Unpacking objects: 13% (13/94) Unpacking objects: 14% (14/94) Unpacking objects: 15% (15/94) Unpacking objects: 17% (16/94) Unpacking objects: 18% (17/94) Unpacking objects: 19% (18/94) Unpacking objects: 20% (19/94) Unpacking objects: 21% (20/94) Unpacking objects: 22% (21/94) Unpacking objects: 23% (22/94) Unpacking objects: 24% (23/94) Unpacking objects: 25% (24/94) Unpacking objects: 26% (25/94) Unpacking objects: 27% (26/94) Unpacking objects: 28% (27/94) Unpacking objects: 29% (28/94) Unpacking objects: 30% (29/94) Unpacking objects: 31% (30/94) Unpacking objects: 32% (31/94) Unpacking objects: 34% (32/94) Unpacking objects: 35% (33/94) Unpacking objects: 36% (34/94) Unpacking objects: 37% (35/94) Unpacking objects: 38% (36/94) Unpacking objects: 39% (37/94) Unpacking objects: 40% (38/94) Unpacking objects: 41% (39/94) Unpacking objects: 42% (40/94) Unpacking objects: 43% (41/94) Unpacking objects: 44% (42/94) Unpacking objects: 45% (43/94) Unpacking objects: 46% (44/94) Unpacking objects: 47% (45/94) Unpacking objects: 48% (46/94) Unpacking objects: 50% (47/94) Unpacking objects: 51% (48/94) Unpacking objects: 52% (49/94) Unpacking objects: 53% (50/94) Unpacking objects: 54% (51/94) Unpacking objects: 55% (52/94) Unpacking objects: 56% (53/94) Unpacking objects: 57% (54/94) Unpacking objects: 58% (55/94) Unpacking objects: 59% (56/94) Unpacking objects: 60% (57/94) Unpacking objects: 61% (58/94) Unpacking objects: 62% (59/94) Unpacking objects: 63% (60/94) Unpacking objects: 64% (61/94) Unpacking objects: 65% (62/94) Unpacking objects: 67% (63/94) Unpacking objects: 68% (64/94) Unpacking objects: 69% (65/94) Unpacking objects: 70% (66/94) Unpacking objects: 71% (67/94) Unpacking objects: 72% (68/94) Unpacking objects: 73% (69/94) Unpacking objects: 74% (70/94) Unpacking objects: 75% (71/94) Unpacking objects: 76% (72/94) Unpacking objects: 77% (73/94) Unpacking objects: 78% (74/94) Unpacking objects: 79% (75/94) Unpacking objects: 80% (76/94) Unpacking objects: 81% (77/94) Unpacking objects: 82% (78/94) Unpacking objects: 84% (79/94) Unpacking objects: 85% (80/94) Unpacking objects: 86% (81/94) Unpacking objects: 87% (82/94) Unpacking objects: 88% (83/94) Unpacking objects: 89% (84/94) Unpacking objects: 90% (85/94) Unpacking objects: 91% (86/94) Unpacking objects: 92% (87/94) Unpacking objects: 93% (88/94) Unpacking objects: 94% (89/94) Unpacking objects: 95% (90/94) remote: Total 94 (delta 4), reused 55 (delta 1), pack-reused 0 (from 0)
  7. 0.83 s Unpacking objects: 96% (91/94) Unpacking objects: 97% (92/94) Unpacking objects: 98% (93/94) Unpacking objects: 100% (94/94) Unpacking objects: 100% (94/94), 116.42 KiB | 4.66 MiB/s, done.
  8. 0.85 s From https://github.com/NorfairKing/schema-dot-org
  9. 0.85 s * branch 19e6b8817e7bec4930f841e0efbadd872c7ae8f6 -> FETCH_HEAD
  10. 2.27 s
  11. 2.99 s Building /nix/store/xxml50x8qpinr4csm0s88q1hpaw9lj0c-schema-dot-org-jsonld-0.0.0.0.drv
  12. 3.42 s [schema-dot-org-jsonld] Phase: setupCompilerEnvironmentPhase
  13. 3.44 s [schema-dot-org-jsonld] Build with /nix/store/k493jzz83044mqayvlb6247l35780kxy-ghc-9.10.3.
  14. 4.43 s [schema-dot-org-jsonld] Phase: unpackPhase
  15. 4.45 s [schema-dot-org-jsonld] unpacking source archive /nix/store/1vv1pjq9810nsfjpdsd8vqzy9m8b1zw4-schema-dot-org-jsonld-source-0.0.0.0/schema-dot-org-jsonld-0.0.0.0.tar.gz
  16. 4.46 s [schema-dot-org-jsonld] source root is schema-dot-org-jsonld-0.0.0.0
  17. 4.48 s [schema-dot-org-jsonld] setting SOURCE_DATE_EPOCH to timestamp 1788937454 of file "schema-dot-org-jsonld-0.0.0.0/test/Spec.hs"
  18. 4.49 s [schema-dot-org-jsonld] Phase: patchPhase
  19. 4.51 s [schema-dot-org-jsonld] Phase: compileBuildDriverPhase
  20. 4.52 s [schema-dot-org-jsonld] setupCompileFlags: -package-db=/build/tmp.smJC0qVq7E/setup-package.conf.d -threaded
  21. 4.60 s [schema-dot-org-jsonld] [1 of 2] Compiling Main ( Setup.hs, /build/tmp.smJC0qVq7E/Main.o )
  22. 4.66 s [schema-dot-org-jsonld] [2 of 2] Linking Setup
  23. 6.07 s [schema-dot-org-jsonld] Phase: updateAutotoolsGnuConfigScriptsPhase
  24. 6.10 s [schema-dot-org-jsonld] Phase: configurePhase
  25. 6.10 s [schema-dot-org-jsonld] configureFlags: --verbose --prefix=/nix/store/difjlfnxiz0pd2himiyfkf9k6y46a6w6-schema-dot-org-jsonld-0.0.0.0 --libdir=$prefix/lib/$compiler/lib --libsubdir=$abi/$libname --docdir=/nix/store/wm84bh14yg74r9cz5w7a6nhbxjc9r27b-schema-dot-org-jsonld-0.0.0.0-doc/share/doc/schema-dot-org-jsonld-0.0.0.0 --with-gcc=gcc --package-db=/build/tmp.smJC0qVq7E/package.conf.d --ghc-option=-j14 --ghc-option=+RTS --ghc-option=-A64M --ghc-option=-RTS --enable-library-profiling --profiling-detail=exported-functions --disable-profiling --enable-shared --disable-coverage --enable-static --disable-executable-dynamic --enable-tests --disable-benchmarks --enable-library-vanilla --disable-library-for-ghci --enable-split-sections --enable-library-stripping --enable-executable-stripping --ghc-option=-haddock --ghc-option=-Wall --ghc-option=-Werror --extra-lib-dirs=/nix/store/wl2nw5l4x4dg6kclbgpq7v9212i1s6cy-ncurses-6.6/lib --extra-lib-dirs=/nix/store/2zs4bbi72plfm8j6zxf1js4f3yc4yzwy-libffi-3.5.2/lib --extra-lib-dirs=/nix/store/qhmqdg27kcrlkl8ida6d5hiacw0y8d21-elfutils-0.194/lib --extra-lib-dirs=/nix/store/y56aqb1m3y5davn6hsv4jfbml78qw4mv-gmp-with-cxx-6.3.0/lib --extra-lib-dirs=/nix/store/wjfhh11sfcdf97mvg7hbxickybxzk850-numactl-2.0.18/lib
  26. 6.12 s [schema-dot-org-jsonld] Using Parsec parser
  27. 6.12 s [schema-dot-org-jsonld] Configuring schema-dot-org-jsonld-0.0.0.0...
  28. 7.06 s [schema-dot-org-jsonld] Dependency aeson: using aeson-2.2.4.1
  29. 7.06 s [schema-dot-org-jsonld] Dependency base >=4.7 && <5: using base-4.20.2.0
  30. 7.06 s [schema-dot-org-jsonld] Dependency bytestring: using bytestring-0.12.2.0
  31. 7.06 s [schema-dot-org-jsonld] Dependency schema-dot-org: using schema-dot-org-0.0.0.0
  32. 7.06 s [schema-dot-org-jsonld] Dependency tagsoup: using tagsoup-0.14.8
  33. 7.06 s [schema-dot-org-jsonld] Dependency text: using text-2.1.3
  34. 7.06 s [schema-dot-org-jsonld] Dependency vector: using vector-0.13.2.0
  35. 7.06 s [schema-dot-org-jsonld] Dependency aeson: using aeson-2.2.4.1
  36. 7.06 s [schema-dot-org-jsonld] Dependency base >=4.7 && <5: using base-4.20.2.0
  37. 7.06 s [schema-dot-org-jsonld] Dependency bytestring: using bytestring-0.12.2.0
  38. 7.06 s [schema-dot-org-jsonld] Dependency path: using path-0.9.6
  39. 7.06 s [schema-dot-org-jsonld] Dependency schema-dot-org-jsonld: using schema-dot-org-jsonld-0.0.0.0
  40. 7.06 s [schema-dot-org-jsonld] Dependency sydtest: using sydtest-0.20.0.1
  41. 7.06 s [schema-dot-org-jsonld] Dependency sydtest-aeson: using sydtest-aeson-0.2.0.1
  42. 7.06 s [schema-dot-org-jsonld] Source component graph:
  43. 7.06 s [schema-dot-org-jsonld] component lib
  44. 7.06 s [schema-dot-org-jsonld] component test:schema-dot-org-jsonld-test dependency lib
  45. 7.06 s [schema-dot-org-jsonld] Configured component graph:
  46. 7.06 s [schema-dot-org-jsonld] component schema-dot-org-jsonld-0.0.0.0-IFXBqy7zHoeF7tncdo1uxB
  47. 7.06 s [schema-dot-org-jsonld] include aeson-2.2.4.1-I5kgiCyiPJO8jEV0bEgUez
  48. 7.06 s [schema-dot-org-jsonld] include base-4.20.2.0-4d66
  49. 7.06 s [schema-dot-org-jsonld] include bytestring-0.12.2.0-25ef
  50. 7.06 s [schema-dot-org-jsonld] include schema-dot-org-0.0.0.0-DK3bNdhkDmvFOAaebGqsq5
  51. 7.06 s [schema-dot-org-jsonld] include tagsoup-0.14.8-BsqbPSEZh9W5mB1CzgSWho
  52. 7.06 s [schema-dot-org-jsonld] include text-2.1.3-3f03
  53. 7.06 s [schema-dot-org-jsonld] include vector-0.13.2.0-4sNODSde54Y5T3xVFmV0fE
  54. 7.06 s [schema-dot-org-jsonld] component schema-dot-org-jsonld-0.0.0.0-Cu5ewoR91fM6pMI6cAFpDW-schema-dot-org-jsonld-test
  55. 7.06 s [schema-dot-org-jsonld] include aeson-2.2.4.1-I5kgiCyiPJO8jEV0bEgUez
  56. 7.06 s [schema-dot-org-jsonld] include base-4.20.2.0-4d66
  57. 7.06 s [schema-dot-org-jsonld] include bytestring-0.12.2.0-25ef
  58. 7.06 s [schema-dot-org-jsonld] include path-0.9.6-L3t3TcndY3P7bshtU9371n
  59. 7.06 s [schema-dot-org-jsonld] include schema-dot-org-jsonld-0.0.0.0-IFXBqy7zHoeF7tncdo1uxB
  60. 7.06 s [schema-dot-org-jsonld] include sydtest-0.20.0.1-Jo2KtBwwg0M2hH86LVxxcs
  61. 7.06 s [schema-dot-org-jsonld] include sydtest-aeson-0.2.0.1-AEtebtKhgEIKIZK2rvdpfT
  62. 7.06 s [schema-dot-org-jsonld] Linked component graph:
  63. 7.06 s [schema-dot-org-jsonld] unit schema-dot-org-jsonld-0.0.0.0-IFXBqy7zHoeF7tncdo1uxB
  64. 7.06 s [schema-dot-org-jsonld] include aeson-2.2.4.1-I5kgiCyiPJO8jEV0bEgUez
  65. 7.06 s [schema-dot-org-jsonld] include base-4.20.2.0-4d66
  66. 7.06 s [schema-dot-org-jsonld] include bytestring-0.12.2.0-25ef
  67. 7.06 s [schema-dot-org-jsonld] include schema-dot-org-0.0.0.0-DK3bNdhkDmvFOAaebGqsq5
  68. 7.06 s [schema-dot-org-jsonld] include tagsoup-0.14.8-BsqbPSEZh9W5mB1CzgSWho
  69. 7.06 s [schema-dot-org-jsonld] include text-2.1.3-3f03
  70. 7.06 s [schema-dot-org-jsonld] include vector-0.13.2.0-4sNODSde54Y5T3xVFmV0fE
  71. 7.06 s [schema-dot-org-jsonld] SchemaDotOrg.JSONLD=schema-dot-org-jsonld-0.0.0.0-IFXBqy7zHoeF7tncdo1uxB:SchemaDotOrg.JSONLD,SchemaDotOrg.JSONLD.Parse=schema-dot-org-jsonld-0.0.0.0-IFXBqy7zHoeF7tncdo1uxB:SchemaDotOrg.JSONLD.Parse,SchemaDotOrg.JSONLD.Render=schema-dot-org-jsonld-0.0.0.0-IFXBqy7zHoeF7tncdo1uxB:SchemaDotOrg.JSONLD.Render,SchemaDotOrg.JSONLD.Tagsoup=schema-dot-org-jsonld-0.0.0.0-IFXBqy7zHoeF7tncdo1uxB:SchemaDotOrg.JSONLD.Tagsoup
  72. 7.06 s [schema-dot-org-jsonld] unit schema-dot-org-jsonld-0.0.0.0-Cu5ewoR91fM6pMI6cAFpDW-schema-dot-org-jsonld-test
  73. 7.06 s [schema-dot-org-jsonld] include aeson-2.2.4.1-I5kgiCyiPJO8jEV0bEgUez
  74. 7.06 s [schema-dot-org-jsonld] include base-4.20.2.0-4d66
  75. 7.06 s [schema-dot-org-jsonld] include bytestring-0.12.2.0-25ef
  76. 7.06 s [schema-dot-org-jsonld] include path-0.9.6-L3t3TcndY3P7bshtU9371n
  77. 7.06 s [schema-dot-org-jsonld] include schema-dot-org-jsonld-0.0.0.0-IFXBqy7zHoeF7tncdo1uxB
  78. 7.06 s [schema-dot-org-jsonld] include sydtest-0.20.0.1-Jo2KtBwwg0M2hH86LVxxcs
  79. 7.06 s [schema-dot-org-jsonld] include sydtest-aeson-0.2.0.1-AEtebtKhgEIKIZK2rvdpfT
  80. 7.06 s [schema-dot-org-jsonld] Ready component graph:
  81. 7.06 s [schema-dot-org-jsonld] definite schema-dot-org-jsonld-0.0.0.0-IFXBqy7zHoeF7tncdo1uxB
  82. 7.06 s [schema-dot-org-jsonld] depends aeson-2.2.4.1-I5kgiCyiPJO8jEV0bEgUez
  83. 7.06 s [schema-dot-org-jsonld] depends base-4.20.2.0-4d66
  84. 7.06 s [schema-dot-org-jsonld] depends bytestring-0.12.2.0-25ef
  85. 7.06 s [schema-dot-org-jsonld] depends schema-dot-org-0.0.0.0-DK3bNdhkDmvFOAaebGqsq5
  86. 7.06 s [schema-dot-org-jsonld] depends tagsoup-0.14.8-BsqbPSEZh9W5mB1CzgSWho
  87. 7.06 s [schema-dot-org-jsonld] depends text-2.1.3-3f03
  88. 7.06 s [schema-dot-org-jsonld] depends vector-0.13.2.0-4sNODSde54Y5T3xVFmV0fE
  89. 7.06 s [schema-dot-org-jsonld] definite schema-dot-org-jsonld-0.0.0.0-Cu5ewoR91fM6pMI6cAFpDW-schema-dot-org-jsonld-test
  90. 7.06 s [schema-dot-org-jsonld] depends aeson-2.2.4.1-I5kgiCyiPJO8jEV0bEgUez
  91. 7.06 s [schema-dot-org-jsonld] depends base-4.20.2.0-4d66
  92. 7.06 s [schema-dot-org-jsonld] depends bytestring-0.12.2.0-25ef
  93. 7.06 s [schema-dot-org-jsonld] depends path-0.9.6-L3t3TcndY3P7bshtU9371n
  94. 7.06 s [schema-dot-org-jsonld] depends schema-dot-org-jsonld-0.0.0.0-IFXBqy7zHoeF7tncdo1uxB
  95. 7.06 s [schema-dot-org-jsonld] depends sydtest-0.20.0.1-Jo2KtBwwg0M2hH86LVxxcs
  96. 7.06 s [schema-dot-org-jsonld] depends sydtest-aeson-0.2.0.1-AEtebtKhgEIKIZK2rvdpfT
  97. 7.06 s [schema-dot-org-jsonld] Using Cabal-3.12.1.0 compiled by ghc-9.10
  98. 7.06 s [schema-dot-org-jsonld] Using compiler: ghc-9.10.3
  99. 7.06 s [schema-dot-org-jsonld] Using install prefix:
  100. 7.06 s [schema-dot-org-jsonld] /nix/store/difjlfnxiz0pd2himiyfkf9k6y46a6w6-schema-dot-org-jsonld-0.0.0.0
  101. 7.06 s [schema-dot-org-jsonld] Executables installed in:
  102. 7.06 s [schema-dot-org-jsonld] /nix/store/difjlfnxiz0pd2himiyfkf9k6y46a6w6-schema-dot-org-jsonld-0.0.0.0/bin
  103. 7.06 s [schema-dot-org-jsonld] Libraries installed in:
  104. 7.06 s [schema-dot-org-jsonld] /nix/store/difjlfnxiz0pd2himiyfkf9k6y46a6w6-schema-dot-org-jsonld-0.0.0.0/lib/ghc-9.10.3/lib/x86_64-linux-ghc-9.10.3-21af/schema-dot-org-jsonld-0.0.0.0-IFXBqy7zHoeF7tncdo1uxB
  105. 7.06 s [schema-dot-org-jsonld] Dynamic Libraries installed in:
  106. 7.06 s [schema-dot-org-jsonld] /nix/store/difjlfnxiz0pd2himiyfkf9k6y46a6w6-schema-dot-org-jsonld-0.0.0.0/lib/ghc-9.10.3/lib/x86_64-linux-ghc-9.10.3-21af
  107. 7.06 s [schema-dot-org-jsonld] Private executables installed in:
  108. 7.07 s [schema-dot-org-jsonld] /nix/store/difjlfnxiz0pd2himiyfkf9k6y46a6w6-schema-dot-org-jsonld-0.0.0.0/libexec/x86_64-linux-ghc-9.10.3-21af/schema-dot-org-jsonld-0.0.0.0
  109. 7.07 s [schema-dot-org-jsonld] Data files installed in:
  110. 7.07 s [schema-dot-org-jsonld] /nix/store/difjlfnxiz0pd2himiyfkf9k6y46a6w6-schema-dot-org-jsonld-0.0.0.0/share/x86_64-linux-ghc-9.10.3-21af/schema-dot-org-jsonld-0.0.0.0
  111. 7.07 s [schema-dot-org-jsonld] Documentation installed in:
  112. 7.07 s [schema-dot-org-jsonld] /nix/store/wm84bh14yg74r9cz5w7a6nhbxjc9r27b-schema-dot-org-jsonld-0.0.0.0-doc/share/doc/schema-dot-org-jsonld-0.0.0.0
  113. 7.07 s [schema-dot-org-jsonld] Configuration files installed in:
  114. 7.07 s [schema-dot-org-jsonld] /nix/store/difjlfnxiz0pd2himiyfkf9k6y46a6w6-schema-dot-org-jsonld-0.0.0.0/etc
  115. 7.07 s [schema-dot-org-jsonld] No alex found
  116. 7.07 s [schema-dot-org-jsonld] Using ar found on system at:
  117. 7.07 s [schema-dot-org-jsonld] /nix/store/mbyy19mdwnfvfwmdi0gqgggx0njvpl1w-binutils-wrapper-2.46/bin/ar
  118. 7.07 s [schema-dot-org-jsonld] No c2hs found
  119. 7.07 s [schema-dot-org-jsonld] No cpphs found
  120. 7.07 s [schema-dot-org-jsonld] No doctest found
  121. 7.07 s [schema-dot-org-jsonld] Using gcc version 15.2.0 given by user at:
  122. 7.07 s [schema-dot-org-jsonld] /nix/store/788mx070y81zjlg5ipcl0cra3afviw9k-gcc-wrapper-15.2.0/bin/gcc
  123. 7.07 s [schema-dot-org-jsonld] Using ghc version 9.10.3 found on system at:
  124. 7.07 s [schema-dot-org-jsonld] /nix/store/k493jzz83044mqayvlb6247l35780kxy-ghc-9.10.3/bin/ghc
  125. 7.07 s [schema-dot-org-jsonld] Using ghc-pkg version 9.10.3 found on system at:
  126. 7.07 s [schema-dot-org-jsonld] /nix/store/k493jzz83044mqayvlb6247l35780kxy-ghc-9.10.3/bin/ghc-pkg-9.10.3
  127. 7.07 s [schema-dot-org-jsonld] No ghcjs found
  128. 7.07 s [schema-dot-org-jsonld] No ghcjs-pkg found
  129. 7.07 s [schema-dot-org-jsonld] No greencard found
  130. 7.07 s [schema-dot-org-jsonld] Using haddock version 2.31.1 found on system at:
  131. 7.07 s [schema-dot-org-jsonld] /nix/store/k493jzz83044mqayvlb6247l35780kxy-ghc-9.10.3/bin/haddock-ghc-9.10.3
  132. 7.07 s [schema-dot-org-jsonld] No happy found
  133. 7.07 s [schema-dot-org-jsonld] Using haskell-suite found on system at: haskell-suite-dummy-location
  134. 7.07 s [schema-dot-org-jsonld] Using haskell-suite-pkg found on system at: haskell-suite-pkg-dummy-location
  135. 7.07 s [schema-dot-org-jsonld] No hmake found
  136. 7.07 s [schema-dot-org-jsonld] Using hpc version 0.69 found on system at:
  137. 7.07 s [schema-dot-org-jsonld] /nix/store/k493jzz83044mqayvlb6247l35780kxy-ghc-9.10.3/bin/hpc-ghc-9.10.3
  138. 7.07 s [schema-dot-org-jsonld] Using hsc2hs version 0.68.10 found on system at:
  139. 7.07 s [schema-dot-org-jsonld] /nix/store/k493jzz83044mqayvlb6247l35780kxy-ghc-9.10.3/bin/hsc2hs-ghc-9.10.3
  140. 7.07 s [schema-dot-org-jsonld] Using hscolour version 1.25 found on system at:
  141. 7.07 s [schema-dot-org-jsonld] /nix/store/hvlf3xzdw0p5s3kybdkch6iqyz0740rc-hscolour-1.25/bin/HsColour
  142. 7.07 s [schema-dot-org-jsonld] No jhc found
  143. 7.07 s [schema-dot-org-jsonld] Using ld found on system at:
  144. 7.07 s [schema-dot-org-jsonld] /nix/store/788mx070y81zjlg5ipcl0cra3afviw9k-gcc-wrapper-15.2.0/bin/ld
  145. 7.07 s [schema-dot-org-jsonld] No pkg-config found
  146. 7.07 s [schema-dot-org-jsonld] Using runghc version 9.10.3 found on system at:
  147. 7.07 s [schema-dot-org-jsonld] /nix/store/k493jzz83044mqayvlb6247l35780kxy-ghc-9.10.3/bin/runghc-9.10.3
  148. 7.07 s [schema-dot-org-jsonld] Using strip version 2.46 found on system at:
  149. 7.07 s [schema-dot-org-jsonld] /nix/store/788mx070y81zjlg5ipcl0cra3afviw9k-gcc-wrapper-15.2.0/bin/strip
  150. 7.07 s [schema-dot-org-jsonld] Using tar found on system at:
  151. 7.07 s [schema-dot-org-jsonld] /nix/store/k5akwnrn9x2afaj2va7g4a2zpdim8l43-gnutar-1.35/bin/tar
  152. 7.07 s [schema-dot-org-jsonld] No uhc found
  153. 7.89 s [schema-dot-org-jsonld] Phase: buildPhase
  154. 7.99 s [schema-dot-org-jsonld] Preprocessing library for schema-dot-org-jsonld-0.0.0.0...
  155. 7.99 s [schema-dot-org-jsonld] Building library for schema-dot-org-jsonld-0.0.0.0...
  156. 8.12 s [schema-dot-org-jsonld] [1 of 5] Compiling Paths_schema_dot_org_jsonld ( dist/build/autogen/Paths_schema_dot_org_jsonld.hs, dist/build/Paths_schema_dot_org_jsonld.o, dist/build/Paths_schema_dot_org_jsonld.dyn_o )
  157. 8.31 s [schema-dot-org-jsonld] [2 of 5] Compiling SchemaDotOrg.JSONLD.Parse ( src/SchemaDotOrg/JSONLD/Parse.hs, dist/build/SchemaDotOrg/JSONLD/Parse.o, dist/build/SchemaDotOrg/JSONLD/Parse.dyn_o )
  158. 9.00 s [schema-dot-org-jsonld] [3 of 5] Compiling SchemaDotOrg.JSONLD.Render ( src/SchemaDotOrg/JSONLD/Render.hs, dist/build/SchemaDotOrg/JSONLD/Render.o, dist/build/SchemaDotOrg/JSONLD/Render.dyn_o )
  159. 9.00 s [schema-dot-org-jsonld] [4 of 5] Compiling SchemaDotOrg.JSONLD.Tagsoup ( src/SchemaDotOrg/JSONLD/Tagsoup.hs, dist/build/SchemaDotOrg/JSONLD/Tagsoup.o, dist/build/SchemaDotOrg/JSONLD/Tagsoup.dyn_o )
  160. 9.10 s [schema-dot-org-jsonld] [5 of 5] Compiling SchemaDotOrg.JSONLD ( src/SchemaDotOrg/JSONLD.hs, dist/build/SchemaDotOrg/JSONLD.o, dist/build/SchemaDotOrg/JSONLD.dyn_o )
  161. 9.42 s [schema-dot-org-jsonld] [1 of 5] Compiling Paths_schema_dot_org_jsonld ( dist/build/autogen/Paths_schema_dot_org_jsonld.hs, dist/build/Paths_schema_dot_org_jsonld.p_o )
  162. 9.96 s [schema-dot-org-jsonld] [2 of 5] Compiling SchemaDotOrg.JSONLD.Parse ( src/SchemaDotOrg/JSONLD/Parse.hs, dist/build/SchemaDotOrg/JSONLD/Parse.p_o )
  163. 10.54 s [schema-dot-org-jsonld] [3 of 5] Compiling SchemaDotOrg.JSONLD.Render ( src/SchemaDotOrg/JSONLD/Render.hs, dist/build/SchemaDotOrg/JSONLD/Render.p_o )
  164. 10.54 s [schema-dot-org-jsonld] [4 of 5] Compiling SchemaDotOrg.JSONLD.Tagsoup ( src/SchemaDotOrg/JSONLD/Tagsoup.hs, dist/build/SchemaDotOrg/JSONLD/Tagsoup.p_o )
  165. 10.67 s [schema-dot-org-jsonld] [5 of 5] Compiling SchemaDotOrg.JSONLD ( src/SchemaDotOrg/JSONLD.hs, dist/build/SchemaDotOrg/JSONLD.p_o )
  166. 13.13 s [schema-dot-org-jsonld] Preprocessing test suite 'schema-dot-org-jsonld-test' for schema-dot-org-jsonld-0.0.0.0...
  167. 13.13 s [schema-dot-org-jsonld] Building test suite 'schema-dot-org-jsonld-test' for schema-dot-org-jsonld-0.0.0.0...
  168. 13.27 s [schema-dot-org-jsonld] [1 of 3] Compiling Paths_schema_dot_org_jsonld ( dist/build/schema-dot-org-jsonld-test/autogen/Paths_schema_dot_org_jsonld.hs, dist/build/schema-dot-org-jsonld-test/schema-dot-org-jsonld-test-tmp/Paths_schema_dot_org_jsonld.o )
  169. 13.41 s [schema-dot-org-jsonld] [2 of 3] Compiling SchemaDotOrg.JSONLD.TagsoupSpec ( test/SchemaDotOrg/JSONLD/TagsoupSpec.hs, dist/build/schema-dot-org-jsonld-test/schema-dot-org-jsonld-test-tmp/SchemaDotOrg/JSONLD/TagsoupSpec.o )
  170. 13.49 s [schema-dot-org-jsonld] test/SchemaDotOrg/JSONLD/TagsoupSpec.hs:34:17: error: [GHC-83865]
  171. 13.49 s [schema-dot-org-jsonld] • Couldn't match type: Path.Internal.Posix.Path
  172. 13.49 s [schema-dot-org-jsonld] Path.Posix.Rel Path.Posix.Dir
  173. 13.49 s [schema-dot-org-jsonld] with: [Char]
  174. 13.49 s [schema-dot-org-jsonld] Expected: FilePath
  175. 13.49 s [schema-dot-org-jsonld] Actual: Path.Internal.Posix.Path Path.Posix.Rel Path.Posix.Dir
  176. 13.49 s [schema-dot-org-jsonld] • In the first argument of ‘scenarioDir’, namely ‘resourcesDir’
  177. 13.50 s [schema-dot-org-jsonld] In the first argument of ‘($)’, namely ‘scenarioDir resourcesDir’
  178. 13.50 s [schema-dot-org-jsonld] In the second argument of ‘($)’, namely
  179. 13.50 s [schema-dot-org-jsonld] ‘scenarioDir resourcesDir
  180. 13.50 s [schema-dot-org-jsonld] $ \ file
  181. 13.50 s [schema-dot-org-jsonld] -> when (fileExtension file == Just ".html")
  182. 13.50 s [schema-dot-org-jsonld] $ do let ...
  183. 13.56 s [schema-dot-org-jsonld] it (unwords [...]) $ do ...’
  184. 13.56 s [schema-dot-org-jsonld] |
  185. 13.56 s [schema-dot-org-jsonld] 34 | scenarioDir resourcesDir $ \file ->
  186. 13.56 s [schema-dot-org-jsonld] | ^^^^^^^^^^^^
  187. 13.56 s [schema-dot-org-jsonld]
  188. 13.56 s [schema-dot-org-jsonld] test/SchemaDotOrg/JSONLD/TagsoupSpec.hs:35:27: error: [GHC-83865]
  189. 13.56 s [schema-dot-org-jsonld] • Couldn't match type: [Char]
  190. 13.56 s [schema-dot-org-jsonld] with: Path.Internal.Posix.Path b0 Path.Posix.File
  191. 13.56 s [schema-dot-org-jsonld] Expected: Path.Internal.Posix.Path b0 Path.Posix.File
  192. 13.56 s [schema-dot-org-jsonld] Actual: FilePath
  193. 13.56 s [schema-dot-org-jsonld] • In the first argument of ‘fileExtension’, namely ‘file’
  194. 13.56 s [schema-dot-org-jsonld] In the first argument of ‘(==)’, namely ‘fileExtension file’
  195. 13.56 s [schema-dot-org-jsonld] In the first argument of ‘when’, namely
  196. 13.56 s [schema-dot-org-jsonld] ‘(fileExtension file == Just ".html")’
  197. 13.56 s [schema-dot-org-jsonld] |
  198. 13.56 s [schema-dot-org-jsonld] 35 | when (fileExtension file == Just ".html") $ do
  199. 13.56 s [schema-dot-org-jsonld] | ^^^^
  200. 13.56 s [schema-dot-org-jsonld]
  201. 13.56 s [schema-dot-org-jsonld] test/SchemaDotOrg/JSONLD/TagsoupSpec.hs:36:48: error: [GHC-83865]
  202. 13.56 s [schema-dot-org-jsonld] • Couldn't match type: [Char]
  203. 13.56 s [schema-dot-org-jsonld] with: Path.Internal.Posix.Path Path.Posix.Rel Path.Posix.File
  204. 13.56 s [schema-dot-org-jsonld] Expected: Path.Internal.Posix.Path Path.Posix.Rel Path.Posix.File
  205. 13.56 s [schema-dot-org-jsonld] Actual: FilePath
  206. 13.56 s [schema-dot-org-jsonld] • In the second argument of ‘(</>)’, namely ‘file’
  207. 13.56 s [schema-dot-org-jsonld] In the first argument of ‘fromRelFile’, namely
  208. 13.56 s [schema-dot-org-jsonld] ‘(resourcesDir </> file)’
  209. 13.56 s [schema-dot-org-jsonld] In the expression: fromRelFile (resourcesDir </> file)
  210. 13.69 s [schema-dot-org-jsonld] |
  211. 13.69 s [schema-dot-org-jsonld] 36 | let fp = fromRelFile (resourcesDir </> file)
  212. 13.69 s [schema-dot-org-jsonld] | ^^^^
  213. 13.69 s [schema-dot-org-jsonld]
  214. 13.79 s Progress: 0 of 1 built (1 failed)
  215. 13.79 s Failed to build schema-dot-org-jsonld after 10.7s
  216. 13.81 s Cannot build '/nix/store/xxml50x8qpinr4csm0s88q1hpaw9lj0c-schema-dot-org-jsonld-0.0.0.0.drv'.
  217. 13.81 s Reason: builder failed with exit code 1.
  218. 13.81 s Output paths:
  219. 13.81 s /nix/store/difjlfnxiz0pd2himiyfkf9k6y46a6w6-schema-dot-org-jsonld-0.0.0.0
  220. 13.81 s /nix/store/wm84bh14yg74r9cz5w7a6nhbxjc9r27b-schema-dot-org-jsonld-0.0.0.0-doc
  221. 13.81 s Last 202 log lines:
  222. 13.81 s > Running phase: setupCompilerEnvironmentPhase
  223. 13.81 s > Build with /nix/store/k493jzz83044mqayvlb6247l35780kxy-ghc-9.10.3.
  224. 13.81 s > Running phase: unpackPhase
  225. 13.81 s > unpacking source archive /nix/store/1vv1pjq9810nsfjpdsd8vqzy9m8b1zw4-schema-dot-org-jsonld-source-0.0.0.0/schema-dot-org-jsonld-0.0.0.0.tar.gz
  226. 13.81 s > source root is schema-dot-org-jsonld-0.0.0.0
  227. 13.81 s > setting SOURCE_DATE_EPOCH to timestamp 1788937454 of file "schema-dot-org-jsonld-0.0.0.0/test/Spec.hs"
  228. 13.81 s > Running phase: patchPhase
  229. 13.81 s > Running phase: compileBuildDriverPhase
  230. 13.81 s > setupCompileFlags: -package-db=/build/tmp.smJC0qVq7E/setup-package.conf.d -threaded
  231. 13.81 s > [1 of 2] Compiling Main ( Setup.hs, /build/tmp.smJC0qVq7E/Main.o )
  232. 13.81 s > [2 of 2] Linking Setup
  233. 13.81 s > Running phase: updateAutotoolsGnuConfigScriptsPhase
  234. 13.81 s > Running phase: configurePhase
  235. 13.81 s > configureFlags: --verbose --prefix=/nix/store/difjlfnxiz0pd2himiyfkf9k6y46a6w6-schema-dot-org-jsonld-0.0.0.0 --libdir=$prefix/lib/$compiler/lib --libsubdir=$abi/$libname --docdir=/nix/store/wm84bh14yg74r9cz5w7a6nhbxjc9r27b-schema-dot-org-jsonld-0.0.0.0-doc/share/doc/schema-dot-org-jsonld-0.0.0.0 --with-gcc=gcc --package-db=/build/tmp.smJC0qVq7E/package.conf.d --ghc-option=-j14 --ghc-option=+RTS --ghc-option=-A64M --ghc-option=-RTS --enable-library-profiling --profiling-detail=exported-functions --disable-profiling --enable-shared --disable-coverage --enable-static --disable-executable-dynamic --enable-tests --disable-benchmarks --enable-library-vanilla --disable-library-for-ghci --enable-split-sections --enable-library-stripping --enable-executable-stripping --ghc-option=-haddock --ghc-option=-Wall --ghc-option=-Werror --extra-lib-dirs=/nix/store/wl2nw5l4x4dg6kclbgpq7v9212i1s6cy-ncurses-6.6/lib --extra-lib-dirs=/nix/store/2zs4bbi72plfm8j6zxf1js4f3yc4yzwy-libffi-3.5.2/lib --extra-lib-dirs=/nix/store/qhmqdg27kcrlkl8ida6d5hiacw0y8d21-elfutils-0.194/lib --extra-lib-dirs=/nix/store/y56aqb1m3y5davn6hsv4jfbml78qw4mv-gmp-with-cxx-6.3.0/lib --extra-lib-dirs=/nix/store/wjfhh11sfcdf97mvg7hbxickybxzk850-numactl-2.0.18/lib
  236. 13.81 s > Using Parsec parser
  237. 13.81 s > Configuring schema-dot-org-jsonld-0.0.0.0...
  238. 13.81 s > Dependency aeson: using aeson-2.2.4.1
  239. 13.81 s > Dependency base >=4.7 && <5: using base-4.20.2.0
  240. 13.81 s > Dependency bytestring: using bytestring-0.12.2.0
  241. 13.81 s > Dependency schema-dot-org: using schema-dot-org-0.0.0.0
  242. 13.81 s > Dependency tagsoup: using tagsoup-0.14.8
  243. 13.81 s > Dependency text: using text-2.1.3
  244. 13.81 s > Dependency vector: using vector-0.13.2.0
  245. 13.81 s > Dependency aeson: using aeson-2.2.4.1
  246. 13.81 s > Dependency base >=4.7 && <5: using base-4.20.2.0
  247. 13.81 s > Dependency bytestring: using bytestring-0.12.2.0
  248. 13.81 s > Dependency path: using path-0.9.6
  249. 13.81 s > Dependency schema-dot-org-jsonld: using schema-dot-org-jsonld-0.0.0.0
  250. 13.81 s > Dependency sydtest: using sydtest-0.20.0.1
  251. 13.81 s > Dependency sydtest-aeson: using sydtest-aeson-0.2.0.1
  252. 13.81 s > Source component graph:
  253. 13.81 s > component lib
  254. 13.81 s > component test:schema-dot-org-jsonld-test dependency lib
  255. 13.81 s > Configured component graph:
  256. 13.81 s > component schema-dot-org-jsonld-0.0.0.0-IFXBqy7zHoeF7tncdo1uxB
  257. 13.81 s > include aeson-2.2.4.1-I5kgiCyiPJO8jEV0bEgUez
  258. 13.81 s > include base-4.20.2.0-4d66
  259. 13.81 s > include bytestring-0.12.2.0-25ef
  260. 13.81 s > include schema-dot-org-0.0.0.0-DK3bNdhkDmvFOAaebGqsq5
  261. 13.81 s > include tagsoup-0.14.8-BsqbPSEZh9W5mB1CzgSWho
  262. 13.81 s > include text-2.1.3-3f03
  263. 13.81 s > include vector-0.13.2.0-4sNODSde54Y5T3xVFmV0fE
  264. 13.81 s > component schema-dot-org-jsonld-0.0.0.0-Cu5ewoR91fM6pMI6cAFpDW-schema-dot-org-jsonld-test
  265. 13.81 s > include aeson-2.2.4.1-I5kgiCyiPJO8jEV0bEgUez
  266. 13.81 s > include base-4.20.2.0-4d66
  267. 13.81 s > include bytestring-0.12.2.0-25ef
  268. 13.81 s > include path-0.9.6-L3t3TcndY3P7bshtU9371n
  269. 13.81 s > include schema-dot-org-jsonld-0.0.0.0-IFXBqy7zHoeF7tncdo1uxB
  270. 13.81 s > include sydtest-0.20.0.1-Jo2KtBwwg0M2hH86LVxxcs
  271. 13.81 s > include sydtest-aeson-0.2.0.1-AEtebtKhgEIKIZK2rvdpfT
  272. 13.81 s > Linked component graph:
  273. 13.81 s > unit schema-dot-org-jsonld-0.0.0.0-IFXBqy7zHoeF7tncdo1uxB
  274. 13.81 s > include aeson-2.2.4.1-I5kgiCyiPJO8jEV0bEgUez
  275. 13.81 s > include base-4.20.2.0-4d66
  276. 13.81 s > include bytestring-0.12.2.0-25ef
  277. 13.81 s > include schema-dot-org-0.0.0.0-DK3bNdhkDmvFOAaebGqsq5
  278. 13.81 s > include tagsoup-0.14.8-BsqbPSEZh9W5mB1CzgSWho
  279. 13.81 s > include text-2.1.3-3f03
  280. 13.81 s > include vector-0.13.2.0-4sNODSde54Y5T3xVFmV0fE
  281. 13.81 s > SchemaDotOrg.JSONLD=schema-dot-org-jsonld-0.0.0.0-IFXBqy7zHoeF7tncdo1uxB:SchemaDotOrg.JSONLD,SchemaDotOrg.JSONLD.Parse=schema-dot-org-jsonld-0.0.0.0-IFXBqy7zHoeF7tncdo1uxB:SchemaDotOrg.JSONLD.Parse,SchemaDotOrg.JSONLD.Render=schema-dot-org-jsonld-0.0.0.0-IFXBqy7zHoeF7tncdo1uxB:SchemaDotOrg.JSONLD.Render,SchemaDotOrg.JSONLD.Tagsoup=schema-dot-org-jsonld-0.0.0.0-IFXBqy7zHoeF7tncdo1uxB:SchemaDotOrg.JSONLD.Tagsoup
  282. 13.81 s > unit schema-dot-org-jsonld-0.0.0.0-Cu5ewoR91fM6pMI6cAFpDW-schema-dot-org-jsonld-test
  283. 13.81 s > include aeson-2.2.4.1-I5kgiCyiPJO8jEV0bEgUez
  284. 13.81 s > include base-4.20.2.0-4d66
  285. 13.81 s > include bytestring-0.12.2.0-25ef
  286. 13.81 s > include path-0.9.6-L3t3TcndY3P7bshtU9371n
  287. 13.81 s > include schema-dot-org-jsonld-0.0.0.0-IFXBqy7zHoeF7tncdo1uxB
  288. 13.81 s > include sydtest-0.20.0.1-Jo2KtBwwg0M2hH86LVxxcs
  289. 13.81 s > include sydtest-aeson-0.2.0.1-AEtebtKhgEIKIZK2rvdpfT
  290. 13.81 s > Ready component graph:
  291. 13.81 s > definite schema-dot-org-jsonld-0.0.0.0-IFXBqy7zHoeF7tncdo1uxB
  292. 13.81 s > depends aeson-2.2.4.1-I5kgiCyiPJO8jEV0bEgUez
  293. 13.81 s > depends base-4.20.2.0-4d66
  294. 13.81 s > depends bytestring-0.12.2.0-25ef
  295. 13.81 s > depends schema-dot-org-0.0.0.0-DK3bNdhkDmvFOAaebGqsq5
  296. 13.81 s > depends tagsoup-0.14.8-BsqbPSEZh9W5mB1CzgSWho
  297. 13.81 s > depends text-2.1.3-3f03
  298. 13.81 s > depends vector-0.13.2.0-4sNODSde54Y5T3xVFmV0fE
  299. 13.81 s > definite schema-dot-org-jsonld-0.0.0.0-Cu5ewoR91fM6pMI6cAFpDW-schema-dot-org-jsonld-test
  300. 13.81 s > depends aeson-2.2.4.1-I5kgiCyiPJO8jEV0bEgUez
  301. 13.81 s > depends base-4.20.2.0-4d66
  302. 13.81 s > depends bytestring-0.12.2.0-25ef
  303. 13.81 s > depends path-0.9.6-L3t3TcndY3P7bshtU9371n
  304. 13.81 s > depends schema-dot-org-jsonld-0.0.0.0-IFXBqy7zHoeF7tncdo1uxB
  305. 13.81 s > depends sydtest-0.20.0.1-Jo2KtBwwg0M2hH86LVxxcs
  306. 13.81 s > depends sydtest-aeson-0.2.0.1-AEtebtKhgEIKIZK2rvdpfT
  307. 13.81 s > Using Cabal-3.12.1.0 compiled by ghc-9.10
  308. 13.81 s > Using compiler: ghc-9.10.3
  309. 13.81 s > Using install prefix:
  310. 13.81 s > /nix/store/difjlfnxiz0pd2himiyfkf9k6y46a6w6-schema-dot-org-jsonld-0.0.0.0
  311. 13.81 s > Executables installed in:
  312. 13.81 s > /nix/store/difjlfnxiz0pd2himiyfkf9k6y46a6w6-schema-dot-org-jsonld-0.0.0.0/bin
  313. 13.81 s > Libraries installed in:
  314. 13.81 s > /nix/store/difjlfnxiz0pd2himiyfkf9k6y46a6w6-schema-dot-org-jsonld-0.0.0.0/lib/ghc-9.10.3/lib/x86_64-linux-ghc-9.10.3-21af/schema-dot-org-jsonld-0.0.0.0-IFXBqy7zHoeF7tncdo1uxB
  315. 13.81 s > Dynamic Libraries installed in:
  316. 13.81 s > /nix/store/difjlfnxiz0pd2himiyfkf9k6y46a6w6-schema-dot-org-jsonld-0.0.0.0/lib/ghc-9.10.3/lib/x86_64-linux-ghc-9.10.3-21af
  317. 13.81 s > Private executables installed in:
  318. 13.81 s > /nix/store/difjlfnxiz0pd2himiyfkf9k6y46a6w6-schema-dot-org-jsonld-0.0.0.0/libexec/x86_64-linux-ghc-9.10.3-21af/schema-dot-org-jsonld-0.0.0.0
  319. 13.81 s > Data files installed in:
  320. 13.81 s > /nix/store/difjlfnxiz0pd2himiyfkf9k6y46a6w6-schema-dot-org-jsonld-0.0.0.0/share/x86_64-linux-ghc-9.10.3-21af/schema-dot-org-jsonld-0.0.0.0
  321. 13.81 s > Documentation installed in:
  322. 13.81 s > /nix/store/wm84bh14yg74r9cz5w7a6nhbxjc9r27b-schema-dot-org-jsonld-0.0.0.0-doc/share/doc/schema-dot-org-jsonld-0.0.0.0
  323. 13.81 s > Configuration files installed in:
  324. 13.81 s > /nix/store/difjlfnxiz0pd2himiyfkf9k6y46a6w6-schema-dot-org-jsonld-0.0.0.0/etc
  325. 13.81 s > No alex found
  326. 13.81 s > Using ar found on system at:
  327. 13.81 s > /nix/store/mbyy19mdwnfvfwmdi0gqgggx0njvpl1w-binutils-wrapper-2.46/bin/ar
  328. 13.81 s > No c2hs found
  329. 13.81 s > No cpphs found
  330. 13.81 s > No doctest found
  331. 13.81 s > Using gcc version 15.2.0 given by user at:
  332. 13.81 s > /nix/store/788mx070y81zjlg5ipcl0cra3afviw9k-gcc-wrapper-15.2.0/bin/gcc
  333. 13.81 s > Using ghc version 9.10.3 found on system at:
  334. 13.81 s > /nix/store/k493jzz83044mqayvlb6247l35780kxy-ghc-9.10.3/bin/ghc
  335. 13.81 s > Using ghc-pkg version 9.10.3 found on system at:
  336. 13.81 s > /nix/store/k493jzz83044mqayvlb6247l35780kxy-ghc-9.10.3/bin/ghc-pkg-9.10.3
  337. 13.81 s > No ghcjs found
  338. 13.81 s > No ghcjs-pkg found
  339. 13.81 s > No greencard found
  340. 13.81 s > Using haddock version 2.31.1 found on system at:
  341. 13.81 s > /nix/store/k493jzz83044mqayvlb6247l35780kxy-ghc-9.10.3/bin/haddock-ghc-9.10.3
  342. 13.81 s > No happy found
  343. 13.81 s > Using haskell-suite found on system at: haskell-suite-dummy-location
  344. 13.81 s > Using haskell-suite-pkg found on system at: haskell-suite-pkg-dummy-location
  345. 13.81 s > No hmake found
  346. 13.81 s > Using hpc version 0.69 found on system at:
  347. 13.81 s > /nix/store/k493jzz83044mqayvlb6247l35780kxy-ghc-9.10.3/bin/hpc-ghc-9.10.3
  348. 13.81 s > Using hsc2hs version 0.68.10 found on system at:
  349. 13.81 s > /nix/store/k493jzz83044mqayvlb6247l35780kxy-ghc-9.10.3/bin/hsc2hs-ghc-9.10.3
  350. 13.81 s > Using hscolour version 1.25 found on system at:
  351. 13.81 s > /nix/store/hvlf3xzdw0p5s3kybdkch6iqyz0740rc-hscolour-1.25/bin/HsColour
  352. 13.81 s > No jhc found
  353. 13.81 s > Using ld found on system at:
  354. 13.81 s > /nix/store/788mx070y81zjlg5ipcl0cra3afviw9k-gcc-wrapper-15.2.0/bin/ld
  355. 13.81 s > No pkg-config found
  356. 13.81 s > Using runghc version 9.10.3 found on system at:
  357. 13.81 s > /nix/store/k493jzz83044mqayvlb6247l35780kxy-ghc-9.10.3/bin/runghc-9.10.3
  358. 13.81 s > Using strip version 2.46 found on system at:
  359. 13.81 s > /nix/store/788mx070y81zjlg5ipcl0cra3afviw9k-gcc-wrapper-15.2.0/bin/strip
  360. 13.81 s > Using tar found on system at:
  361. 13.81 s > /nix/store/k5akwnrn9x2afaj2va7g4a2zpdim8l43-gnutar-1.35/bin/tar
  362. 13.81 s > No uhc found
  363. 13.81 s > Running phase: buildPhase
  364. 13.81 s > Preprocessing library for schema-dot-org-jsonld-0.0.0.0...
  365. 13.81 s > Building library for schema-dot-org-jsonld-0.0.0.0...
  366. 13.81 s > [1 of 5] Compiling Paths_schema_dot_org_jsonld ( dist/build/autogen/Paths_schema_dot_org_jsonld.hs, dist/build/Paths_schema_dot_org_jsonld.o, dist/build/Paths_schema_dot_org_jsonld.dyn_o )
  367. 13.81 s > [2 of 5] Compiling SchemaDotOrg.JSONLD.Parse ( src/SchemaDotOrg/JSONLD/Parse.hs, dist/build/SchemaDotOrg/JSONLD/Parse.o, dist/build/SchemaDotOrg/JSONLD/Parse.dyn_o )
  368. 13.81 s > [3 of 5] Compiling SchemaDotOrg.JSONLD.Render ( src/SchemaDotOrg/JSONLD/Render.hs, dist/build/SchemaDotOrg/JSONLD/Render.o, dist/build/SchemaDotOrg/JSONLD/Render.dyn_o )
  369. 13.81 s > [4 of 5] Compiling SchemaDotOrg.JSONLD.Tagsoup ( src/SchemaDotOrg/JSONLD/Tagsoup.hs, dist/build/SchemaDotOrg/JSONLD/Tagsoup.o, dist/build/SchemaDotOrg/JSONLD/Tagsoup.dyn_o )
  370. 13.81 s > [5 of 5] Compiling SchemaDotOrg.JSONLD ( src/SchemaDotOrg/JSONLD.hs, dist/build/SchemaDotOrg/JSONLD.o, dist/build/SchemaDotOrg/JSONLD.dyn_o )
  371. 13.81 s > [1 of 5] Compiling Paths_schema_dot_org_jsonld ( dist/build/autogen/Paths_schema_dot_org_jsonld.hs, dist/build/Paths_schema_dot_org_jsonld.p_o )
  372. 13.81 s > [2 of 5] Compiling SchemaDotOrg.JSONLD.Parse ( src/SchemaDotOrg/JSONLD/Parse.hs, dist/build/SchemaDotOrg/JSONLD/Parse.p_o )
  373. 13.81 s > [3 of 5] Compiling SchemaDotOrg.JSONLD.Render ( src/SchemaDotOrg/JSONLD/Render.hs, dist/build/SchemaDotOrg/JSONLD/Render.p_o )
  374. 13.81 s > [4 of 5] Compiling SchemaDotOrg.JSONLD.Tagsoup ( src/SchemaDotOrg/JSONLD/Tagsoup.hs, dist/build/SchemaDotOrg/JSONLD/Tagsoup.p_o )
  375. 13.81 s > [5 of 5] Compiling SchemaDotOrg.JSONLD ( src/SchemaDotOrg/JSONLD.hs, dist/build/SchemaDotOrg/JSONLD.p_o )
  376. 13.81 s > Preprocessing test suite 'schema-dot-org-jsonld-test' for schema-dot-org-jsonld-0.0.0.0...
  377. 13.81 s > Building test suite 'schema-dot-org-jsonld-test' for schema-dot-org-jsonld-0.0.0.0...
  378. 13.81 s > [1 of 3] Compiling Paths_schema_dot_org_jsonld ( dist/build/schema-dot-org-jsonld-test/autogen/Paths_schema_dot_org_jsonld.hs, dist/build/schema-dot-org-jsonld-test/schema-dot-org-jsonld-test-tmp/Paths_schema_dot_org_jsonld.o )
  379. 13.81 s > [2 of 3] Compiling SchemaDotOrg.JSONLD.TagsoupSpec ( test/SchemaDotOrg/JSONLD/TagsoupSpec.hs, dist/build/schema-dot-org-jsonld-test/schema-dot-org-jsonld-test-tmp/SchemaDotOrg/JSONLD/TagsoupSpec.o )
  380. 13.81 s > test/SchemaDotOrg/JSONLD/TagsoupSpec.hs:34:17: error: [GHC-83865]
  381. 13.81 s > • Couldn't match type: Path.Internal.Posix.Path
  382. 13.81 s > Path.Posix.Rel Path.Posix.Dir
  383. 13.81 s > with: [Char]
  384. 13.81 s > Expected: FilePath
  385. 13.81 s > Actual: Path.Internal.Posix.Path Path.Posix.Rel Path.Posix.Dir
  386. 13.81 s > • In the first argument of ‘scenarioDir’, namely ‘resourcesDir’
  387. 13.81 s > In the first argument of ‘($)’, namely ‘scenarioDir resourcesDir’
  388. 13.81 s > In the second argument of ‘($)’, namely
  389. 13.81 s > ‘scenarioDir resourcesDir
  390. 13.81 s > $ \ file
  391. 13.81 s > -> when (fileExtension file == Just ".html")
  392. 13.81 s > $ do let ...
  393. 13.81 s > it (unwords [...]) $ do ...’
  394. 13.81 s > |
  395. 13.81 s > 34 | scenarioDir resourcesDir $ \file ->
  396. 13.81 s > | ^^^^^^^^^^^^
  397. 13.81 s >
  398. 13.81 s > test/SchemaDotOrg/JSONLD/TagsoupSpec.hs:35:27: error: [GHC-83865]
  399. 13.81 s > • Couldn't match type: [Char]
  400. 13.81 s > with: Path.Internal.Posix.Path b0 Path.Posix.File
  401. 13.81 s > Expected: Path.Internal.Posix.Path b0 Path.Posix.File
  402. 13.81 s > Actual: FilePath
  403. 13.81 s > • In the first argument of ‘fileExtension’, namely ‘file’
  404. 13.81 s > In the first argument of ‘(==)’, namely ‘fileExtension file’
  405. 13.81 s > In the first argument of ‘when’, namely
  406. 13.81 s > ‘(fileExtension file == Just ".html")’
  407. 13.81 s > |
  408. 13.81 s > 35 | when (fileExtension file == Just ".html") $ do
  409. 13.81 s > | ^^^^
  410. 13.81 s >
  411. 13.81 s > test/SchemaDotOrg/JSONLD/TagsoupSpec.hs:36:48: error: [GHC-83865]
  412. 13.81 s > • Couldn't match type: [Char]
  413. 13.81 s > with: Path.Internal.Posix.Path Path.Posix.Rel Path.Posix.File
  414. 13.81 s > Expected: Path.Internal.Posix.Path Path.Posix.Rel Path.Posix.File
  415. 13.81 s > Actual: FilePath
  416. 13.81 s > • In the second argument of ‘(</>)’, namely ‘file’
  417. 13.81 s > In the first argument of ‘fromRelFile’, namely
  418. 13.81 s > ‘(resourcesDir </> file)’
  419. 13.81 s > In the expression: fromRelFile (resourcesDir </> file)
  420. 13.81 s > |
  421. 13.81 s > 36 | let fp = fromRelFile (resourcesDir </> file)
  422. 13.81 s > | ^^^^
  423. 13.81 s >
  424. 13.81 s For full logs, run:
  425. 13.81 s nix log /nix/store/xxml50x8qpinr4csm0s88q1hpaw9lj0c-schema-dot-org-jsonld-0.0.0.0.drv
  426. 14.36 s Build failed.