- 0.00 s
$ /nix/store/9ypz3flqsrl5xl495mm8h645gadjsxi1-coreutils-9.11/bin/timeout --kill-after=15s 7200s /nix/store/23zk8sgzamrbmj1fday15szf7f2279s8-nix-2.34.7/bin/nix --extra-experimental-features nix-command --extra-experimental-features flakes --log-format internal-json build --no-link --print-out-paths git+https://github.com/NorfairKing/schema-dot-org?ref=master&rev=19e6b8817e7bec4930f841e0efbadd872c7ae8f6&shallow=1#checks.x86_64-linux.jsonld --print-build-logs
- 0.09 s
- 0.29 s
Building /nix/store/xxml50x8qpinr4csm0s88q1hpaw9lj0c-schema-dot-org-jsonld-0.0.0.0.drv
- 0.66 s
[schema-dot-org-jsonld] Phase: setupCompilerEnvironmentPhase
- 0.67 s
[schema-dot-org-jsonld] Build with /nix/store/k493jzz83044mqayvlb6247l35780kxy-ghc-9.10.3.
- 1.51 s
[schema-dot-org-jsonld] Phase: unpackPhase
- 1.51 s
[schema-dot-org-jsonld] unpacking source archive /nix/store/1vv1pjq9810nsfjpdsd8vqzy9m8b1zw4-schema-dot-org-jsonld-source-0.0.0.0/schema-dot-org-jsonld-0.0.0.0.tar.gz
- 1.53 s
[schema-dot-org-jsonld] source root is schema-dot-org-jsonld-0.0.0.0
- 1.54 s
[schema-dot-org-jsonld] setting SOURCE_DATE_EPOCH to timestamp 1788937454 of file "schema-dot-org-jsonld-0.0.0.0/test/Spec.hs"
- 1.56 s
[schema-dot-org-jsonld] Phase: patchPhase
- 1.57 s
[schema-dot-org-jsonld] Phase: compileBuildDriverPhase
- 1.58 s
[schema-dot-org-jsonld] setupCompileFlags: -package-db=/build/tmp.Tg1EWQb1Gg/setup-package.conf.d -threaded
- 1.65 s
[schema-dot-org-jsonld] [1 of 2] Compiling Main ( Setup.hs, /build/tmp.Tg1EWQb1Gg/Main.o )
- 1.70 s
[schema-dot-org-jsonld] [2 of 2] Linking Setup
- 3.10 s
[schema-dot-org-jsonld] Phase: updateAutotoolsGnuConfigScriptsPhase
- 3.12 s
[schema-dot-org-jsonld] Phase: configurePhase
- 3.13 s
[schema-dot-org-jsonld] configureFlags: --verbose --prefix=/nix/store/difjlfnxiz0pd2himiyfkf9k6y46a6w6-schema-dot-org-jsonld-0.0.0.0 --libdir=$prefix/lib/$compiler/lib --libsubdir=$abi/$libname --docdir=/nix/store/wm84bh14yg74r9cz5w7a6nhbxjc9r27b-schema-dot-org-jsonld-0.0.0.0-doc/share/doc/schema-dot-org-jsonld-0.0.0.0 --with-gcc=gcc --package-db=/build/tmp.Tg1EWQb1Gg/package.conf.d --ghc-option=-j14 --ghc-option=+RTS --ghc-option=-A64M --ghc-option=-RTS --enable-library-profiling --profiling-detail=exported-functions --disable-profiling --enable-shared --disable-coverage --enable-static --disable-executable-dynamic --enable-tests --disable-benchmarks --enable-library-vanilla --disable-library-for-ghci --enable-split-sections --enable-library-stripping --enable-executable-stripping --ghc-option=-haddock --ghc-option=-Wall --ghc-option=-Werror --extra-lib-dirs=/nix/store/wl2nw5l4x4dg6kclbgpq7v9212i1s6cy-ncurses-6.6/lib --extra-lib-dirs=/nix/store/2zs4bbi72plfm8j6zxf1js4f3yc4yzwy-libffi-3.5.2/lib --extra-lib-dirs=/nix/store/qhmqdg27kcrlkl8ida6d5hiacw0y8d21-elfutils-0.194/lib --extra-lib-dirs=/nix/store/y56aqb1m3y5davn6hsv4jfbml78qw4mv-gmp-with-cxx-6.3.0/lib --extra-lib-dirs=/nix/store/wjfhh11sfcdf97mvg7hbxickybxzk850-numactl-2.0.18/lib
- 3.14 s
[schema-dot-org-jsonld] Using Parsec parser
- 3.14 s
[schema-dot-org-jsonld] Configuring schema-dot-org-jsonld-0.0.0.0...
- 4.05 s
[schema-dot-org-jsonld] Dependency aeson: using aeson-2.2.4.1
- 4.05 s
[schema-dot-org-jsonld] Dependency base >=4.7 && <5: using base-4.20.2.0
- 4.05 s
[schema-dot-org-jsonld] Dependency bytestring: using bytestring-0.12.2.0
- 4.05 s
[schema-dot-org-jsonld] Dependency schema-dot-org: using schema-dot-org-0.0.0.0
- 4.05 s
[schema-dot-org-jsonld] Dependency tagsoup: using tagsoup-0.14.8
- 4.05 s
[schema-dot-org-jsonld] Dependency text: using text-2.1.3
- 4.05 s
[schema-dot-org-jsonld] Dependency vector: using vector-0.13.2.0
- 4.05 s
[schema-dot-org-jsonld] Dependency aeson: using aeson-2.2.4.1
- 4.05 s
[schema-dot-org-jsonld] Dependency base >=4.7 && <5: using base-4.20.2.0
- 4.05 s
[schema-dot-org-jsonld] Dependency bytestring: using bytestring-0.12.2.0
- 4.05 s
[schema-dot-org-jsonld] Dependency path: using path-0.9.6
- 4.05 s
[schema-dot-org-jsonld] Dependency schema-dot-org-jsonld: using schema-dot-org-jsonld-0.0.0.0
- 4.05 s
[schema-dot-org-jsonld] Dependency sydtest: using sydtest-0.20.0.1
- 4.05 s
[schema-dot-org-jsonld] Dependency sydtest-aeson: using sydtest-aeson-0.2.0.1
- 4.05 s
[schema-dot-org-jsonld] Source component graph:
- 4.05 s
[schema-dot-org-jsonld] component lib
- 4.05 s
[schema-dot-org-jsonld] component test:schema-dot-org-jsonld-test dependency lib
- 4.05 s
[schema-dot-org-jsonld] Configured component graph:
- 4.05 s
[schema-dot-org-jsonld] component schema-dot-org-jsonld-0.0.0.0-IFXBqy7zHoeF7tncdo1uxB
- 4.05 s
[schema-dot-org-jsonld] include aeson-2.2.4.1-I5kgiCyiPJO8jEV0bEgUez
- 4.05 s
[schema-dot-org-jsonld] include base-4.20.2.0-4d66
- 4.05 s
[schema-dot-org-jsonld] include bytestring-0.12.2.0-25ef
- 4.05 s
[schema-dot-org-jsonld] include schema-dot-org-0.0.0.0-DK3bNdhkDmvFOAaebGqsq5
- 4.05 s
[schema-dot-org-jsonld] include tagsoup-0.14.8-BsqbPSEZh9W5mB1CzgSWho
- 4.05 s
[schema-dot-org-jsonld] include text-2.1.3-3f03
- 4.05 s
[schema-dot-org-jsonld] include vector-0.13.2.0-4sNODSde54Y5T3xVFmV0fE
- 4.05 s
[schema-dot-org-jsonld] component schema-dot-org-jsonld-0.0.0.0-Cu5ewoR91fM6pMI6cAFpDW-schema-dot-org-jsonld-test
- 4.05 s
[schema-dot-org-jsonld] include aeson-2.2.4.1-I5kgiCyiPJO8jEV0bEgUez
- 4.05 s
[schema-dot-org-jsonld] include base-4.20.2.0-4d66
- 4.05 s
[schema-dot-org-jsonld] include bytestring-0.12.2.0-25ef
- 4.05 s
[schema-dot-org-jsonld] include path-0.9.6-L3t3TcndY3P7bshtU9371n
- 4.05 s
[schema-dot-org-jsonld] include schema-dot-org-jsonld-0.0.0.0-IFXBqy7zHoeF7tncdo1uxB
- 4.05 s
[schema-dot-org-jsonld] include sydtest-0.20.0.1-Jo2KtBwwg0M2hH86LVxxcs
- 4.05 s
[schema-dot-org-jsonld] include sydtest-aeson-0.2.0.1-AEtebtKhgEIKIZK2rvdpfT
- 4.05 s
[schema-dot-org-jsonld] Linked component graph:
- 4.05 s
[schema-dot-org-jsonld] unit schema-dot-org-jsonld-0.0.0.0-IFXBqy7zHoeF7tncdo1uxB
- 4.05 s
[schema-dot-org-jsonld] include aeson-2.2.4.1-I5kgiCyiPJO8jEV0bEgUez
- 4.05 s
[schema-dot-org-jsonld] include base-4.20.2.0-4d66
- 4.05 s
[schema-dot-org-jsonld] include bytestring-0.12.2.0-25ef
- 4.05 s
[schema-dot-org-jsonld] include schema-dot-org-0.0.0.0-DK3bNdhkDmvFOAaebGqsq5
- 4.05 s
[schema-dot-org-jsonld] include tagsoup-0.14.8-BsqbPSEZh9W5mB1CzgSWho
- 4.05 s
[schema-dot-org-jsonld] include text-2.1.3-3f03
- 4.05 s
[schema-dot-org-jsonld] include vector-0.13.2.0-4sNODSde54Y5T3xVFmV0fE
- 4.05 s
[schema-dot-org-jsonld] SchemaDotOrg.JSONLD=schema-dot-org-jsonld-0.0.0.0-IFXBqy7zHoeF7tncdo1uxB:SchemaDotOrg.JSONLD,SchemaDotOrg.JSONLD.Parse=schema-dot-org-jsonld-0.0.0.0-IFXBqy7zHoeF7tncdo1uxB:SchemaDotOrg.JSONLD.Parse,SchemaDotOrg.JSONLD.Render=schema-dot-org-jsonld-0.0.0.0-IFXBqy7zHoeF7tncdo1uxB:SchemaDotOrg.JSONLD.Render,SchemaDotOrg.JSONLD.Tagsoup=schema-dot-org-jsonld-0.0.0.0-IFXBqy7zHoeF7tncdo1uxB:SchemaDotOrg.JSONLD.Tagsoup
- 4.05 s
[schema-dot-org-jsonld] unit schema-dot-org-jsonld-0.0.0.0-Cu5ewoR91fM6pMI6cAFpDW-schema-dot-org-jsonld-test
- 4.05 s
[schema-dot-org-jsonld] include aeson-2.2.4.1-I5kgiCyiPJO8jEV0bEgUez
- 4.05 s
[schema-dot-org-jsonld] include base-4.20.2.0-4d66
- 4.05 s
[schema-dot-org-jsonld] include bytestring-0.12.2.0-25ef
- 4.05 s
[schema-dot-org-jsonld] include path-0.9.6-L3t3TcndY3P7bshtU9371n
- 4.05 s
[schema-dot-org-jsonld] include schema-dot-org-jsonld-0.0.0.0-IFXBqy7zHoeF7tncdo1uxB
- 4.05 s
[schema-dot-org-jsonld] include sydtest-0.20.0.1-Jo2KtBwwg0M2hH86LVxxcs
- 4.05 s
[schema-dot-org-jsonld] include sydtest-aeson-0.2.0.1-AEtebtKhgEIKIZK2rvdpfT
- 4.05 s
[schema-dot-org-jsonld] Ready component graph:
- 4.05 s
[schema-dot-org-jsonld] definite schema-dot-org-jsonld-0.0.0.0-IFXBqy7zHoeF7tncdo1uxB
- 4.05 s
[schema-dot-org-jsonld] depends aeson-2.2.4.1-I5kgiCyiPJO8jEV0bEgUez
- 4.05 s
[schema-dot-org-jsonld] depends base-4.20.2.0-4d66
- 4.05 s
[schema-dot-org-jsonld] depends bytestring-0.12.2.0-25ef
- 4.05 s
[schema-dot-org-jsonld] depends schema-dot-org-0.0.0.0-DK3bNdhkDmvFOAaebGqsq5
- 4.05 s
[schema-dot-org-jsonld] depends tagsoup-0.14.8-BsqbPSEZh9W5mB1CzgSWho
- 4.05 s
[schema-dot-org-jsonld] depends text-2.1.3-3f03
- 4.05 s
[schema-dot-org-jsonld] depends vector-0.13.2.0-4sNODSde54Y5T3xVFmV0fE
- 4.05 s
[schema-dot-org-jsonld] definite schema-dot-org-jsonld-0.0.0.0-Cu5ewoR91fM6pMI6cAFpDW-schema-dot-org-jsonld-test
- 4.05 s
[schema-dot-org-jsonld] depends aeson-2.2.4.1-I5kgiCyiPJO8jEV0bEgUez
- 4.05 s
[schema-dot-org-jsonld] depends base-4.20.2.0-4d66
- 4.05 s
[schema-dot-org-jsonld] depends bytestring-0.12.2.0-25ef
- 4.05 s
[schema-dot-org-jsonld] depends path-0.9.6-L3t3TcndY3P7bshtU9371n
- 4.05 s
[schema-dot-org-jsonld] depends schema-dot-org-jsonld-0.0.0.0-IFXBqy7zHoeF7tncdo1uxB
- 4.05 s
[schema-dot-org-jsonld] depends sydtest-0.20.0.1-Jo2KtBwwg0M2hH86LVxxcs
- 4.05 s
[schema-dot-org-jsonld] depends sydtest-aeson-0.2.0.1-AEtebtKhgEIKIZK2rvdpfT
- 4.05 s
[schema-dot-org-jsonld] Using Cabal-3.12.1.0 compiled by ghc-9.10
- 4.05 s
[schema-dot-org-jsonld] Using compiler: ghc-9.10.3
- 4.05 s
[schema-dot-org-jsonld] Using install prefix:
- 4.05 s
[schema-dot-org-jsonld] /nix/store/difjlfnxiz0pd2himiyfkf9k6y46a6w6-schema-dot-org-jsonld-0.0.0.0
- 4.05 s
[schema-dot-org-jsonld] Executables installed in:
- 4.05 s
[schema-dot-org-jsonld] /nix/store/difjlfnxiz0pd2himiyfkf9k6y46a6w6-schema-dot-org-jsonld-0.0.0.0/bin
- 4.05 s
[schema-dot-org-jsonld] Libraries installed in:
- 4.05 s
[schema-dot-org-jsonld] /nix/store/difjlfnxiz0pd2himiyfkf9k6y46a6w6-schema-dot-org-jsonld-0.0.0.0/lib/ghc-9.10.3/lib/x86_64-linux-ghc-9.10.3-21af/schema-dot-org-jsonld-0.0.0.0-IFXBqy7zHoeF7tncdo1uxB
- 4.05 s
[schema-dot-org-jsonld] Dynamic Libraries installed in:
- 4.05 s
[schema-dot-org-jsonld] /nix/store/difjlfnxiz0pd2himiyfkf9k6y46a6w6-schema-dot-org-jsonld-0.0.0.0/lib/ghc-9.10.3/lib/x86_64-linux-ghc-9.10.3-21af
- 4.05 s
[schema-dot-org-jsonld] Private executables installed in:
- 4.05 s
[schema-dot-org-jsonld] /nix/store/difjlfnxiz0pd2himiyfkf9k6y46a6w6-schema-dot-org-jsonld-0.0.0.0/libexec/x86_64-linux-ghc-9.10.3-21af/schema-dot-org-jsonld-0.0.0.0
- 4.05 s
[schema-dot-org-jsonld] Data files installed in:
- 4.05 s
[schema-dot-org-jsonld] /nix/store/difjlfnxiz0pd2himiyfkf9k6y46a6w6-schema-dot-org-jsonld-0.0.0.0/share/x86_64-linux-ghc-9.10.3-21af/schema-dot-org-jsonld-0.0.0.0
- 4.05 s
[schema-dot-org-jsonld] Documentation installed in:
- 4.05 s
[schema-dot-org-jsonld] /nix/store/wm84bh14yg74r9cz5w7a6nhbxjc9r27b-schema-dot-org-jsonld-0.0.0.0-doc/share/doc/schema-dot-org-jsonld-0.0.0.0
- 4.05 s
[schema-dot-org-jsonld] Configuration files installed in:
- 4.05 s
[schema-dot-org-jsonld] /nix/store/difjlfnxiz0pd2himiyfkf9k6y46a6w6-schema-dot-org-jsonld-0.0.0.0/etc
- 4.05 s
[schema-dot-org-jsonld] No alex found
- 4.05 s
[schema-dot-org-jsonld] Using ar found on system at:
- 4.05 s
[schema-dot-org-jsonld] /nix/store/mbyy19mdwnfvfwmdi0gqgggx0njvpl1w-binutils-wrapper-2.46/bin/ar
- 4.05 s
[schema-dot-org-jsonld] No c2hs found
- 4.05 s
[schema-dot-org-jsonld] No cpphs found
- 4.05 s
[schema-dot-org-jsonld] No doctest found
- 4.05 s
[schema-dot-org-jsonld] Using gcc version 15.2.0 given by user at:
- 4.05 s
[schema-dot-org-jsonld] /nix/store/788mx070y81zjlg5ipcl0cra3afviw9k-gcc-wrapper-15.2.0/bin/gcc
- 4.05 s
[schema-dot-org-jsonld] Using ghc version 9.10.3 found on system at:
- 4.05 s
[schema-dot-org-jsonld] /nix/store/k493jzz83044mqayvlb6247l35780kxy-ghc-9.10.3/bin/ghc
- 4.05 s
[schema-dot-org-jsonld] Using ghc-pkg version 9.10.3 found on system at:
- 4.05 s
[schema-dot-org-jsonld] /nix/store/k493jzz83044mqayvlb6247l35780kxy-ghc-9.10.3/bin/ghc-pkg-9.10.3
- 4.05 s
[schema-dot-org-jsonld] No ghcjs found
- 4.05 s
[schema-dot-org-jsonld] No ghcjs-pkg found
- 4.05 s
[schema-dot-org-jsonld] No greencard found
- 4.05 s
[schema-dot-org-jsonld] Using haddock version 2.31.1 found on system at:
- 4.05 s
[schema-dot-org-jsonld] /nix/store/k493jzz83044mqayvlb6247l35780kxy-ghc-9.10.3/bin/haddock-ghc-9.10.3
- 4.05 s
[schema-dot-org-jsonld] No happy found
- 4.05 s
[schema-dot-org-jsonld] Using haskell-suite found on system at: haskell-suite-dummy-location
- 4.05 s
[schema-dot-org-jsonld] Using haskell-suite-pkg found on system at: haskell-suite-pkg-dummy-location
- 4.05 s
[schema-dot-org-jsonld] No hmake found
- 4.05 s
[schema-dot-org-jsonld] Using hpc version 0.69 found on system at:
- 4.05 s
[schema-dot-org-jsonld] /nix/store/k493jzz83044mqayvlb6247l35780kxy-ghc-9.10.3/bin/hpc-ghc-9.10.3
- 4.05 s
[schema-dot-org-jsonld] Using hsc2hs version 0.68.10 found on system at:
- 4.05 s
[schema-dot-org-jsonld] /nix/store/k493jzz83044mqayvlb6247l35780kxy-ghc-9.10.3/bin/hsc2hs-ghc-9.10.3
- 4.05 s
[schema-dot-org-jsonld] Using hscolour version 1.25 found on system at:
- 4.05 s
[schema-dot-org-jsonld] /nix/store/hvlf3xzdw0p5s3kybdkch6iqyz0740rc-hscolour-1.25/bin/HsColour
- 4.05 s
[schema-dot-org-jsonld] No jhc found
- 4.05 s
[schema-dot-org-jsonld] Using ld found on system at:
- 4.05 s
[schema-dot-org-jsonld] /nix/store/788mx070y81zjlg5ipcl0cra3afviw9k-gcc-wrapper-15.2.0/bin/ld
- 4.05 s
[schema-dot-org-jsonld] No pkg-config found
- 4.05 s
[schema-dot-org-jsonld] Using runghc version 9.10.3 found on system at:
- 4.05 s
[schema-dot-org-jsonld] /nix/store/k493jzz83044mqayvlb6247l35780kxy-ghc-9.10.3/bin/runghc-9.10.3
- 4.05 s
[schema-dot-org-jsonld] Using strip version 2.46 found on system at:
- 4.05 s
[schema-dot-org-jsonld] /nix/store/788mx070y81zjlg5ipcl0cra3afviw9k-gcc-wrapper-15.2.0/bin/strip
- 4.05 s
[schema-dot-org-jsonld] Using tar found on system at:
- 4.05 s
[schema-dot-org-jsonld] /nix/store/k5akwnrn9x2afaj2va7g4a2zpdim8l43-gnutar-1.35/bin/tar
- 4.05 s
[schema-dot-org-jsonld] No uhc found
- 4.90 s
[schema-dot-org-jsonld] Phase: buildPhase
- 4.98 s
[schema-dot-org-jsonld] Preprocessing library for schema-dot-org-jsonld-0.0.0.0...
- 4.98 s
[schema-dot-org-jsonld] Building library for schema-dot-org-jsonld-0.0.0.0...
- 5.08 s
[schema-dot-org-jsonld] [1 of 5] Compiling Paths_schema_dot_org_jsonld ( dist/build/autogen/Paths_schema_dot_org_jsonld.hs, dist/build/Paths_schema_dot_org_jsonld.o, dist/build/Paths_schema_dot_org_jsonld.dyn_o )
- 5.26 s
[schema-dot-org-jsonld] [2 of 5] Compiling SchemaDotOrg.JSONLD.Parse ( src/SchemaDotOrg/JSONLD/Parse.hs, dist/build/SchemaDotOrg/JSONLD/Parse.o, dist/build/SchemaDotOrg/JSONLD/Parse.dyn_o )
- 5.89 s
[schema-dot-org-jsonld] [3 of 5] Compiling SchemaDotOrg.JSONLD.Render ( src/SchemaDotOrg/JSONLD/Render.hs, dist/build/SchemaDotOrg/JSONLD/Render.o, dist/build/SchemaDotOrg/JSONLD/Render.dyn_o )
- 5.89 s
[schema-dot-org-jsonld] [4 of 5] Compiling SchemaDotOrg.JSONLD.Tagsoup ( src/SchemaDotOrg/JSONLD/Tagsoup.hs, dist/build/SchemaDotOrg/JSONLD/Tagsoup.o, dist/build/SchemaDotOrg/JSONLD/Tagsoup.dyn_o )
- 5.99 s
[schema-dot-org-jsonld] [5 of 5] Compiling SchemaDotOrg.JSONLD ( src/SchemaDotOrg/JSONLD.hs, dist/build/SchemaDotOrg/JSONLD.o, dist/build/SchemaDotOrg/JSONLD.dyn_o )
- 6.26 s
[schema-dot-org-jsonld] [1 of 5] Compiling Paths_schema_dot_org_jsonld ( dist/build/autogen/Paths_schema_dot_org_jsonld.hs, dist/build/Paths_schema_dot_org_jsonld.p_o )
- 6.59 s
[schema-dot-org-jsonld] [2 of 5] Compiling SchemaDotOrg.JSONLD.Parse ( src/SchemaDotOrg/JSONLD/Parse.hs, dist/build/SchemaDotOrg/JSONLD/Parse.p_o )
- 7.15 s
[schema-dot-org-jsonld] [3 of 5] Compiling SchemaDotOrg.JSONLD.Render ( src/SchemaDotOrg/JSONLD/Render.hs, dist/build/SchemaDotOrg/JSONLD/Render.p_o )
- 7.15 s
[schema-dot-org-jsonld] [4 of 5] Compiling SchemaDotOrg.JSONLD.Tagsoup ( src/SchemaDotOrg/JSONLD/Tagsoup.hs, dist/build/SchemaDotOrg/JSONLD/Tagsoup.p_o )
- 7.27 s
[schema-dot-org-jsonld] [5 of 5] Compiling SchemaDotOrg.JSONLD ( src/SchemaDotOrg/JSONLD.hs, dist/build/SchemaDotOrg/JSONLD.p_o )
- 9.61 s
[schema-dot-org-jsonld] Preprocessing test suite 'schema-dot-org-jsonld-test' for schema-dot-org-jsonld-0.0.0.0...
- 9.61 s
[schema-dot-org-jsonld] Building test suite 'schema-dot-org-jsonld-test' for schema-dot-org-jsonld-0.0.0.0...
- 9.73 s
[schema-dot-org-jsonld] [1 of 3] Compiling Paths_schema_dot_org_jsonld ( dist/build/schema-dot-org-jsonld-test/autogen/Paths_schema_dot_org_jsonld.hs, dist/build/schema-dot-org-jsonld-test/schema-dot-org-jsonld-test-tmp/Paths_schema_dot_org_jsonld.o )
- 9.83 s
[schema-dot-org-jsonld] [2 of 3] Compiling SchemaDotOrg.JSONLD.TagsoupSpec ( test/SchemaDotOrg/JSONLD/TagsoupSpec.hs, dist/build/schema-dot-org-jsonld-test/schema-dot-org-jsonld-test-tmp/SchemaDotOrg/JSONLD/TagsoupSpec.o )
- 9.91 s
[schema-dot-org-jsonld] test/SchemaDotOrg/JSONLD/TagsoupSpec.hs:34:17: error: [GHC-83865]
- 9.91 s
[schema-dot-org-jsonld] • Couldn't match type: Path.Internal.Posix.Path
- 9.91 s
[schema-dot-org-jsonld] Path.Posix.Rel Path.Posix.Dir
- 9.91 s
[schema-dot-org-jsonld] with: [Char]
- 9.91 s
[schema-dot-org-jsonld] Expected: FilePath
- 9.91 s
[schema-dot-org-jsonld] Actual: Path.Internal.Posix.Path Path.Posix.Rel Path.Posix.Dir
- 9.91 s
[schema-dot-org-jsonld] • In the first argument of ‘scenarioDir’, namely ‘resourcesDir’
- 9.91 s
[schema-dot-org-jsonld] In the first argument of ‘($)’, namely ‘scenarioDir resourcesDir’
- 9.91 s
[schema-dot-org-jsonld] In the second argument of ‘($)’, namely
- 9.91 s
[schema-dot-org-jsonld] ‘scenarioDir resourcesDir
- 9.91 s
[schema-dot-org-jsonld] $ \ file
- 9.91 s
[schema-dot-org-jsonld] -> when (fileExtension file == Just ".html")
- 9.91 s
[schema-dot-org-jsonld] $ do let ...
- 9.91 s
[schema-dot-org-jsonld] it (unwords [...]) $ do ...’
- 9.91 s
[schema-dot-org-jsonld] |
- 9.91 s
[schema-dot-org-jsonld] 34 | scenarioDir resourcesDir $ \file ->
- 9.91 s
[schema-dot-org-jsonld] | ^^^^^^^^^^^^
- 9.91 s
[schema-dot-org-jsonld]
- 9.91 s
[schema-dot-org-jsonld] test/SchemaDotOrg/JSONLD/TagsoupSpec.hs:35:27: error: [GHC-83865]
- 9.91 s
[schema-dot-org-jsonld] • Couldn't match type: [Char]
- 9.91 s
[schema-dot-org-jsonld] with: Path.Internal.Posix.Path b0 Path.Posix.File
- 9.91 s
[schema-dot-org-jsonld] Expected: Path.Internal.Posix.Path b0 Path.Posix.File
- 9.91 s
[schema-dot-org-jsonld] Actual: FilePath
- 9.91 s
[schema-dot-org-jsonld] • In the first argument of ‘fileExtension’, namely ‘file’
- 9.91 s
[schema-dot-org-jsonld] In the first argument of ‘(==)’, namely ‘fileExtension file’
- 9.91 s
[schema-dot-org-jsonld] In the first argument of ‘when’, namely
- 9.91 s
[schema-dot-org-jsonld] ‘(fileExtension file == Just ".html")’
- 9.91 s
[schema-dot-org-jsonld] |
- 9.91 s
[schema-dot-org-jsonld] 35 | when (fileExtension file == Just ".html") $ do
- 9.91 s
[schema-dot-org-jsonld] | ^^^^
- 9.91 s
[schema-dot-org-jsonld]
- 9.91 s
[schema-dot-org-jsonld] test/SchemaDotOrg/JSONLD/TagsoupSpec.hs:36:48: error: [GHC-83865]
- 9.91 s
[schema-dot-org-jsonld] • Couldn't match type: [Char]
- 9.91 s
[schema-dot-org-jsonld] with: Path.Internal.Posix.Path Path.Posix.Rel Path.Posix.File
- 9.91 s
[schema-dot-org-jsonld] Expected: Path.Internal.Posix.Path Path.Posix.Rel Path.Posix.File
- 9.91 s
[schema-dot-org-jsonld] Actual: FilePath
- 9.91 s
[schema-dot-org-jsonld] • In the second argument of ‘(</>)’, namely ‘file’
- 9.91 s
[schema-dot-org-jsonld] In the first argument of ‘fromRelFile’, namely
- 9.91 s
[schema-dot-org-jsonld] ‘(resourcesDir </> file)’
- 9.91 s
[schema-dot-org-jsonld] In the expression: fromRelFile (resourcesDir </> file)
- 9.91 s
[schema-dot-org-jsonld] |
- 9.91 s
[schema-dot-org-jsonld] 36 | let fp = fromRelFile (resourcesDir </> file)
- 9.91 s
[schema-dot-org-jsonld] | ^^^^
- 9.91 s
[schema-dot-org-jsonld]
- 10.20 s
Progress: 0 of 1 built (1 failed)
- 10.20 s
Failed to build schema-dot-org-jsonld after 9.9s
- 10.21 s
Cannot build '/nix/store/xxml50x8qpinr4csm0s88q1hpaw9lj0c-schema-dot-org-jsonld-0.0.0.0.drv'.
- 10.21 s
Reason: builder failed with exit code 1.
- 10.21 s
Output paths:
- 10.21 s
/nix/store/difjlfnxiz0pd2himiyfkf9k6y46a6w6-schema-dot-org-jsonld-0.0.0.0
- 10.21 s
/nix/store/wm84bh14yg74r9cz5w7a6nhbxjc9r27b-schema-dot-org-jsonld-0.0.0.0-doc
- 10.21 s
Last 202 log lines:
- 10.21 s
> Running phase: setupCompilerEnvironmentPhase
- 10.21 s
> Build with /nix/store/k493jzz83044mqayvlb6247l35780kxy-ghc-9.10.3.
- 10.21 s
> Running phase: unpackPhase
- 10.21 s
> unpacking source archive /nix/store/1vv1pjq9810nsfjpdsd8vqzy9m8b1zw4-schema-dot-org-jsonld-source-0.0.0.0/schema-dot-org-jsonld-0.0.0.0.tar.gz
- 10.21 s
> source root is schema-dot-org-jsonld-0.0.0.0
- 10.21 s
> setting SOURCE_DATE_EPOCH to timestamp 1788937454 of file "schema-dot-org-jsonld-0.0.0.0/test/Spec.hs"
- 10.21 s
> Running phase: patchPhase
- 10.21 s
> Running phase: compileBuildDriverPhase
- 10.21 s
> setupCompileFlags: -package-db=/build/tmp.Tg1EWQb1Gg/setup-package.conf.d -threaded
- 10.21 s
> [1 of 2] Compiling Main ( Setup.hs, /build/tmp.Tg1EWQb1Gg/Main.o )
- 10.21 s
> [2 of 2] Linking Setup
- 10.21 s
> Running phase: updateAutotoolsGnuConfigScriptsPhase
- 10.21 s
> Running phase: configurePhase
- 10.21 s
> configureFlags: --verbose --prefix=/nix/store/difjlfnxiz0pd2himiyfkf9k6y46a6w6-schema-dot-org-jsonld-0.0.0.0 --libdir=$prefix/lib/$compiler/lib --libsubdir=$abi/$libname --docdir=/nix/store/wm84bh14yg74r9cz5w7a6nhbxjc9r27b-schema-dot-org-jsonld-0.0.0.0-doc/share/doc/schema-dot-org-jsonld-0.0.0.0 --with-gcc=gcc --package-db=/build/tmp.Tg1EWQb1Gg/package.conf.d --ghc-option=-j14 --ghc-option=+RTS --ghc-option=-A64M --ghc-option=-RTS --enable-library-profiling --profiling-detail=exported-functions --disable-profiling --enable-shared --disable-coverage --enable-static --disable-executable-dynamic --enable-tests --disable-benchmarks --enable-library-vanilla --disable-library-for-ghci --enable-split-sections --enable-library-stripping --enable-executable-stripping --ghc-option=-haddock --ghc-option=-Wall --ghc-option=-Werror --extra-lib-dirs=/nix/store/wl2nw5l4x4dg6kclbgpq7v9212i1s6cy-ncurses-6.6/lib --extra-lib-dirs=/nix/store/2zs4bbi72plfm8j6zxf1js4f3yc4yzwy-libffi-3.5.2/lib --extra-lib-dirs=/nix/store/qhmqdg27kcrlkl8ida6d5hiacw0y8d21-elfutils-0.194/lib --extra-lib-dirs=/nix/store/y56aqb1m3y5davn6hsv4jfbml78qw4mv-gmp-with-cxx-6.3.0/lib --extra-lib-dirs=/nix/store/wjfhh11sfcdf97mvg7hbxickybxzk850-numactl-2.0.18/lib
- 10.21 s
> Using Parsec parser
- 10.21 s
> Configuring schema-dot-org-jsonld-0.0.0.0...
- 10.21 s
> Dependency aeson: using aeson-2.2.4.1
- 10.21 s
> Dependency base >=4.7 && <5: using base-4.20.2.0
- 10.21 s
> Dependency bytestring: using bytestring-0.12.2.0
- 10.21 s
> Dependency schema-dot-org: using schema-dot-org-0.0.0.0
- 10.21 s
> Dependency tagsoup: using tagsoup-0.14.8
- 10.21 s
> Dependency text: using text-2.1.3
- 10.21 s
> Dependency vector: using vector-0.13.2.0
- 10.21 s
> Dependency aeson: using aeson-2.2.4.1
- 10.21 s
> Dependency base >=4.7 && <5: using base-4.20.2.0
- 10.21 s
> Dependency bytestring: using bytestring-0.12.2.0
- 10.21 s
> Dependency path: using path-0.9.6
- 10.21 s
> Dependency schema-dot-org-jsonld: using schema-dot-org-jsonld-0.0.0.0
- 10.21 s
> Dependency sydtest: using sydtest-0.20.0.1
- 10.21 s
> Dependency sydtest-aeson: using sydtest-aeson-0.2.0.1
- 10.21 s
> Source component graph:
- 10.21 s
> component lib
- 10.21 s
> component test:schema-dot-org-jsonld-test dependency lib
- 10.21 s
> Configured component graph:
- 10.21 s
> component schema-dot-org-jsonld-0.0.0.0-IFXBqy7zHoeF7tncdo1uxB
- 10.21 s
> include aeson-2.2.4.1-I5kgiCyiPJO8jEV0bEgUez
- 10.21 s
> include base-4.20.2.0-4d66
- 10.21 s
> include bytestring-0.12.2.0-25ef
- 10.21 s
> include schema-dot-org-0.0.0.0-DK3bNdhkDmvFOAaebGqsq5
- 10.21 s
> include tagsoup-0.14.8-BsqbPSEZh9W5mB1CzgSWho
- 10.21 s
> include text-2.1.3-3f03
- 10.21 s
> include vector-0.13.2.0-4sNODSde54Y5T3xVFmV0fE
- 10.21 s
> component schema-dot-org-jsonld-0.0.0.0-Cu5ewoR91fM6pMI6cAFpDW-schema-dot-org-jsonld-test
- 10.21 s
> include aeson-2.2.4.1-I5kgiCyiPJO8jEV0bEgUez
- 10.21 s
> include base-4.20.2.0-4d66
- 10.21 s
> include bytestring-0.12.2.0-25ef
- 10.21 s
> include path-0.9.6-L3t3TcndY3P7bshtU9371n
- 10.21 s
> include schema-dot-org-jsonld-0.0.0.0-IFXBqy7zHoeF7tncdo1uxB
- 10.21 s
> include sydtest-0.20.0.1-Jo2KtBwwg0M2hH86LVxxcs
- 10.21 s
> include sydtest-aeson-0.2.0.1-AEtebtKhgEIKIZK2rvdpfT
- 10.21 s
> Linked component graph:
- 10.21 s
> unit schema-dot-org-jsonld-0.0.0.0-IFXBqy7zHoeF7tncdo1uxB
- 10.21 s
> include aeson-2.2.4.1-I5kgiCyiPJO8jEV0bEgUez
- 10.21 s
> include base-4.20.2.0-4d66
- 10.21 s
> include bytestring-0.12.2.0-25ef
- 10.21 s
> include schema-dot-org-0.0.0.0-DK3bNdhkDmvFOAaebGqsq5
- 10.21 s
> include tagsoup-0.14.8-BsqbPSEZh9W5mB1CzgSWho
- 10.21 s
> include text-2.1.3-3f03
- 10.21 s
> include vector-0.13.2.0-4sNODSde54Y5T3xVFmV0fE
- 10.21 s
> SchemaDotOrg.JSONLD=schema-dot-org-jsonld-0.0.0.0-IFXBqy7zHoeF7tncdo1uxB:SchemaDotOrg.JSONLD,SchemaDotOrg.JSONLD.Parse=schema-dot-org-jsonld-0.0.0.0-IFXBqy7zHoeF7tncdo1uxB:SchemaDotOrg.JSONLD.Parse,SchemaDotOrg.JSONLD.Render=schema-dot-org-jsonld-0.0.0.0-IFXBqy7zHoeF7tncdo1uxB:SchemaDotOrg.JSONLD.Render,SchemaDotOrg.JSONLD.Tagsoup=schema-dot-org-jsonld-0.0.0.0-IFXBqy7zHoeF7tncdo1uxB:SchemaDotOrg.JSONLD.Tagsoup
- 10.21 s
> unit schema-dot-org-jsonld-0.0.0.0-Cu5ewoR91fM6pMI6cAFpDW-schema-dot-org-jsonld-test
- 10.21 s
> include aeson-2.2.4.1-I5kgiCyiPJO8jEV0bEgUez
- 10.21 s
> include base-4.20.2.0-4d66
- 10.21 s
> include bytestring-0.12.2.0-25ef
- 10.21 s
> include path-0.9.6-L3t3TcndY3P7bshtU9371n
- 10.21 s
> include schema-dot-org-jsonld-0.0.0.0-IFXBqy7zHoeF7tncdo1uxB
- 10.21 s
> include sydtest-0.20.0.1-Jo2KtBwwg0M2hH86LVxxcs
- 10.21 s
> include sydtest-aeson-0.2.0.1-AEtebtKhgEIKIZK2rvdpfT
- 10.21 s
> Ready component graph:
- 10.21 s
> definite schema-dot-org-jsonld-0.0.0.0-IFXBqy7zHoeF7tncdo1uxB
- 10.21 s
> depends aeson-2.2.4.1-I5kgiCyiPJO8jEV0bEgUez
- 10.21 s
> depends base-4.20.2.0-4d66
- 10.21 s
> depends bytestring-0.12.2.0-25ef
- 10.21 s
> depends schema-dot-org-0.0.0.0-DK3bNdhkDmvFOAaebGqsq5
- 10.21 s
> depends tagsoup-0.14.8-BsqbPSEZh9W5mB1CzgSWho
- 10.21 s
> depends text-2.1.3-3f03
- 10.21 s
> depends vector-0.13.2.0-4sNODSde54Y5T3xVFmV0fE
- 10.21 s
> definite schema-dot-org-jsonld-0.0.0.0-Cu5ewoR91fM6pMI6cAFpDW-schema-dot-org-jsonld-test
- 10.21 s
> depends aeson-2.2.4.1-I5kgiCyiPJO8jEV0bEgUez
- 10.21 s
> depends base-4.20.2.0-4d66
- 10.21 s
> depends bytestring-0.12.2.0-25ef
- 10.21 s
> depends path-0.9.6-L3t3TcndY3P7bshtU9371n
- 10.21 s
> depends schema-dot-org-jsonld-0.0.0.0-IFXBqy7zHoeF7tncdo1uxB
- 10.21 s
> depends sydtest-0.20.0.1-Jo2KtBwwg0M2hH86LVxxcs
- 10.21 s
> depends sydtest-aeson-0.2.0.1-AEtebtKhgEIKIZK2rvdpfT
- 10.21 s
> Using Cabal-3.12.1.0 compiled by ghc-9.10
- 10.21 s
> Using compiler: ghc-9.10.3
- 10.21 s
> Using install prefix:
- 10.21 s
> /nix/store/difjlfnxiz0pd2himiyfkf9k6y46a6w6-schema-dot-org-jsonld-0.0.0.0
- 10.21 s
> Executables installed in:
- 10.21 s
> /nix/store/difjlfnxiz0pd2himiyfkf9k6y46a6w6-schema-dot-org-jsonld-0.0.0.0/bin
- 10.21 s
> Libraries installed in:
- 10.21 s
> /nix/store/difjlfnxiz0pd2himiyfkf9k6y46a6w6-schema-dot-org-jsonld-0.0.0.0/lib/ghc-9.10.3/lib/x86_64-linux-ghc-9.10.3-21af/schema-dot-org-jsonld-0.0.0.0-IFXBqy7zHoeF7tncdo1uxB
- 10.21 s
> Dynamic Libraries installed in:
- 10.21 s
> /nix/store/difjlfnxiz0pd2himiyfkf9k6y46a6w6-schema-dot-org-jsonld-0.0.0.0/lib/ghc-9.10.3/lib/x86_64-linux-ghc-9.10.3-21af
- 10.21 s
> Private executables installed in:
- 10.21 s
> /nix/store/difjlfnxiz0pd2himiyfkf9k6y46a6w6-schema-dot-org-jsonld-0.0.0.0/libexec/x86_64-linux-ghc-9.10.3-21af/schema-dot-org-jsonld-0.0.0.0
- 10.21 s
> Data files installed in:
- 10.21 s
> /nix/store/difjlfnxiz0pd2himiyfkf9k6y46a6w6-schema-dot-org-jsonld-0.0.0.0/share/x86_64-linux-ghc-9.10.3-21af/schema-dot-org-jsonld-0.0.0.0
- 10.21 s
> Documentation installed in:
- 10.21 s
> /nix/store/wm84bh14yg74r9cz5w7a6nhbxjc9r27b-schema-dot-org-jsonld-0.0.0.0-doc/share/doc/schema-dot-org-jsonld-0.0.0.0
- 10.21 s
> Configuration files installed in:
- 10.21 s
> /nix/store/difjlfnxiz0pd2himiyfkf9k6y46a6w6-schema-dot-org-jsonld-0.0.0.0/etc
- 10.21 s
> No alex found
- 10.21 s
> Using ar found on system at:
- 10.21 s
> /nix/store/mbyy19mdwnfvfwmdi0gqgggx0njvpl1w-binutils-wrapper-2.46/bin/ar
- 10.21 s
> No c2hs found
- 10.21 s
> No cpphs found
- 10.21 s
> No doctest found
- 10.21 s
> Using gcc version 15.2.0 given by user at:
- 10.21 s
> /nix/store/788mx070y81zjlg5ipcl0cra3afviw9k-gcc-wrapper-15.2.0/bin/gcc
- 10.21 s
> Using ghc version 9.10.3 found on system at:
- 10.21 s
> /nix/store/k493jzz83044mqayvlb6247l35780kxy-ghc-9.10.3/bin/ghc
- 10.21 s
> Using ghc-pkg version 9.10.3 found on system at:
- 10.21 s
> /nix/store/k493jzz83044mqayvlb6247l35780kxy-ghc-9.10.3/bin/ghc-pkg-9.10.3
- 10.21 s
> No ghcjs found
- 10.21 s
> No ghcjs-pkg found
- 10.21 s
> No greencard found
- 10.21 s
> Using haddock version 2.31.1 found on system at:
- 10.21 s
> /nix/store/k493jzz83044mqayvlb6247l35780kxy-ghc-9.10.3/bin/haddock-ghc-9.10.3
- 10.21 s
> No happy found
- 10.21 s
> Using haskell-suite found on system at: haskell-suite-dummy-location
- 10.21 s
> Using haskell-suite-pkg found on system at: haskell-suite-pkg-dummy-location
- 10.21 s
> No hmake found
- 10.21 s
> Using hpc version 0.69 found on system at:
- 10.21 s
> /nix/store/k493jzz83044mqayvlb6247l35780kxy-ghc-9.10.3/bin/hpc-ghc-9.10.3
- 10.21 s
> Using hsc2hs version 0.68.10 found on system at:
- 10.21 s
> /nix/store/k493jzz83044mqayvlb6247l35780kxy-ghc-9.10.3/bin/hsc2hs-ghc-9.10.3
- 10.21 s
> Using hscolour version 1.25 found on system at:
- 10.21 s
> /nix/store/hvlf3xzdw0p5s3kybdkch6iqyz0740rc-hscolour-1.25/bin/HsColour
- 10.21 s
> No jhc found
- 10.21 s
> Using ld found on system at:
- 10.21 s
> /nix/store/788mx070y81zjlg5ipcl0cra3afviw9k-gcc-wrapper-15.2.0/bin/ld
- 10.21 s
> No pkg-config found
- 10.21 s
> Using runghc version 9.10.3 found on system at:
- 10.21 s
> /nix/store/k493jzz83044mqayvlb6247l35780kxy-ghc-9.10.3/bin/runghc-9.10.3
- 10.21 s
> Using strip version 2.46 found on system at:
- 10.21 s
> /nix/store/788mx070y81zjlg5ipcl0cra3afviw9k-gcc-wrapper-15.2.0/bin/strip
- 10.21 s
> Using tar found on system at:
- 10.21 s
> /nix/store/k5akwnrn9x2afaj2va7g4a2zpdim8l43-gnutar-1.35/bin/tar
- 10.21 s
> No uhc found
- 10.21 s
> Running phase: buildPhase
- 10.21 s
> Preprocessing library for schema-dot-org-jsonld-0.0.0.0...
- 10.21 s
> Building library for schema-dot-org-jsonld-0.0.0.0...
- 10.21 s
> [1 of 5] Compiling Paths_schema_dot_org_jsonld ( dist/build/autogen/Paths_schema_dot_org_jsonld.hs, dist/build/Paths_schema_dot_org_jsonld.o, dist/build/Paths_schema_dot_org_jsonld.dyn_o )
- 10.21 s
> [2 of 5] Compiling SchemaDotOrg.JSONLD.Parse ( src/SchemaDotOrg/JSONLD/Parse.hs, dist/build/SchemaDotOrg/JSONLD/Parse.o, dist/build/SchemaDotOrg/JSONLD/Parse.dyn_o )
- 10.21 s
> [3 of 5] Compiling SchemaDotOrg.JSONLD.Render ( src/SchemaDotOrg/JSONLD/Render.hs, dist/build/SchemaDotOrg/JSONLD/Render.o, dist/build/SchemaDotOrg/JSONLD/Render.dyn_o )
- 10.21 s
> [4 of 5] Compiling SchemaDotOrg.JSONLD.Tagsoup ( src/SchemaDotOrg/JSONLD/Tagsoup.hs, dist/build/SchemaDotOrg/JSONLD/Tagsoup.o, dist/build/SchemaDotOrg/JSONLD/Tagsoup.dyn_o )
- 10.21 s
> [5 of 5] Compiling SchemaDotOrg.JSONLD ( src/SchemaDotOrg/JSONLD.hs, dist/build/SchemaDotOrg/JSONLD.o, dist/build/SchemaDotOrg/JSONLD.dyn_o )
- 10.21 s
> [1 of 5] Compiling Paths_schema_dot_org_jsonld ( dist/build/autogen/Paths_schema_dot_org_jsonld.hs, dist/build/Paths_schema_dot_org_jsonld.p_o )
- 10.21 s
> [2 of 5] Compiling SchemaDotOrg.JSONLD.Parse ( src/SchemaDotOrg/JSONLD/Parse.hs, dist/build/SchemaDotOrg/JSONLD/Parse.p_o )
- 10.21 s
> [3 of 5] Compiling SchemaDotOrg.JSONLD.Render ( src/SchemaDotOrg/JSONLD/Render.hs, dist/build/SchemaDotOrg/JSONLD/Render.p_o )
- 10.21 s
> [4 of 5] Compiling SchemaDotOrg.JSONLD.Tagsoup ( src/SchemaDotOrg/JSONLD/Tagsoup.hs, dist/build/SchemaDotOrg/JSONLD/Tagsoup.p_o )
- 10.21 s
> [5 of 5] Compiling SchemaDotOrg.JSONLD ( src/SchemaDotOrg/JSONLD.hs, dist/build/SchemaDotOrg/JSONLD.p_o )
- 10.21 s
> Preprocessing test suite 'schema-dot-org-jsonld-test' for schema-dot-org-jsonld-0.0.0.0...
- 10.21 s
> Building test suite 'schema-dot-org-jsonld-test' for schema-dot-org-jsonld-0.0.0.0...
- 10.21 s
> [1 of 3] Compiling Paths_schema_dot_org_jsonld ( dist/build/schema-dot-org-jsonld-test/autogen/Paths_schema_dot_org_jsonld.hs, dist/build/schema-dot-org-jsonld-test/schema-dot-org-jsonld-test-tmp/Paths_schema_dot_org_jsonld.o )
- 10.21 s
> [2 of 3] Compiling SchemaDotOrg.JSONLD.TagsoupSpec ( test/SchemaDotOrg/JSONLD/TagsoupSpec.hs, dist/build/schema-dot-org-jsonld-test/schema-dot-org-jsonld-test-tmp/SchemaDotOrg/JSONLD/TagsoupSpec.o )
- 10.21 s
> test/SchemaDotOrg/JSONLD/TagsoupSpec.hs:34:17: error: [GHC-83865]
- 10.21 s
> • Couldn't match type: Path.Internal.Posix.Path
- 10.21 s
> Path.Posix.Rel Path.Posix.Dir
- 10.21 s
> with: [Char]
- 10.21 s
> Expected: FilePath
- 10.21 s
> Actual: Path.Internal.Posix.Path Path.Posix.Rel Path.Posix.Dir
- 10.21 s
> • In the first argument of ‘scenarioDir’, namely ‘resourcesDir’
- 10.21 s
> In the first argument of ‘($)’, namely ‘scenarioDir resourcesDir’
- 10.21 s
> In the second argument of ‘($)’, namely
- 10.21 s
> ‘scenarioDir resourcesDir
- 10.21 s
> $ \ file
- 10.21 s
> -> when (fileExtension file == Just ".html")
- 10.21 s
> $ do let ...
- 10.21 s
> it (unwords [...]) $ do ...’
- 10.21 s
> |
- 10.21 s
> 34 | scenarioDir resourcesDir $ \file ->
- 10.21 s
> | ^^^^^^^^^^^^
- 10.21 s
>
- 10.21 s
> test/SchemaDotOrg/JSONLD/TagsoupSpec.hs:35:27: error: [GHC-83865]
- 10.21 s
> • Couldn't match type: [Char]
- 10.21 s
> with: Path.Internal.Posix.Path b0 Path.Posix.File
- 10.21 s
> Expected: Path.Internal.Posix.Path b0 Path.Posix.File
- 10.21 s
> Actual: FilePath
- 10.21 s
> • In the first argument of ‘fileExtension’, namely ‘file’
- 10.21 s
> In the first argument of ‘(==)’, namely ‘fileExtension file’
- 10.21 s
> In the first argument of ‘when’, namely
- 10.21 s
> ‘(fileExtension file == Just ".html")’
- 10.21 s
> |
- 10.21 s
> 35 | when (fileExtension file == Just ".html") $ do
- 10.21 s
> | ^^^^
- 10.21 s
>
- 10.21 s
> test/SchemaDotOrg/JSONLD/TagsoupSpec.hs:36:48: error: [GHC-83865]
- 10.21 s
> • Couldn't match type: [Char]
- 10.21 s
> with: Path.Internal.Posix.Path Path.Posix.Rel Path.Posix.File
- 10.21 s
> Expected: Path.Internal.Posix.Path Path.Posix.Rel Path.Posix.File
- 10.21 s
> Actual: FilePath
- 10.21 s
> • In the second argument of ‘(</>)’, namely ‘file’
- 10.21 s
> In the first argument of ‘fromRelFile’, namely
- 10.21 s
> ‘(resourcesDir </> file)’
- 10.21 s
> In the expression: fromRelFile (resourcesDir </> file)
- 10.21 s
> |
- 10.21 s
> 36 | let fp = fromRelFile (resourcesDir </> file)
- 10.21 s
> | ^^^^
- 10.21 s
>
- 10.21 s
For full logs, run:
- 10.21 s
nix log /nix/store/xxml50x8qpinr4csm0s88q1hpaw9lj0c-schema-dot-org-jsonld-0.0.0.0.drv
- 10.32 s
Build failed.