1. 0.00 s $ /nix/store/9ypz3flqsrl5xl495mm8h645gadjsxi1-coreutils-9.11/bin/timeout --kill-after=15s 7200s /nix/store/23zk8sgzamrbmj1fday15szf7f2279s8-nix-2.34.7/bin/nix --extra-experimental-features nix-command --extra-experimental-features flakes --log-format internal-json build --no-link --print-out-paths git+https://github.com/NorfairKing/schema-dot-org?ref=master&rev=3a1492b22d4bb71e528c42ea81cc32f33e9d359c&shallow=1#checks.x86_64-linux.jsonld --print-build-logs
  2. 0.09 s
  3. 0.25 s Building /nix/store/b7wxkz1av6hmgals5h16625kcxfjpvyg-schema-dot-org-jsonld-0.0.0.0.drv
  4. 0.56 s [schema-dot-org-jsonld] Phase: setupCompilerEnvironmentPhase
  5. 0.56 s [schema-dot-org-jsonld] Build with /nix/store/k493jzz83044mqayvlb6247l35780kxy-ghc-9.10.3.
  6. 1.24 s [schema-dot-org-jsonld] Phase: unpackPhase
  7. 1.25 s [schema-dot-org-jsonld] unpacking source archive /nix/store/9q5dm03axrmxqhm6x7iqpyv5947n8j8l-schema-dot-org-jsonld-source-0.0.0.0/schema-dot-org-jsonld-0.0.0.0.tar.gz
  8. 1.26 s [schema-dot-org-jsonld] source root is schema-dot-org-jsonld-0.0.0.0
  9. 1.27 s [schema-dot-org-jsonld] setting SOURCE_DATE_EPOCH to timestamp 1788936908 of file "schema-dot-org-jsonld-0.0.0.0/test/Spec.hs"
  10. 1.28 s [schema-dot-org-jsonld] Phase: patchPhase
  11. 1.29 s [schema-dot-org-jsonld] Phase: compileBuildDriverPhase
  12. 1.30 s [schema-dot-org-jsonld] setupCompileFlags: -package-db=/build/tmp.LNgiOeDdWd/setup-package.conf.d -threaded
  13. 1.34 s [schema-dot-org-jsonld] [1 of 2] Compiling Main ( Setup.hs, /build/tmp.LNgiOeDdWd/Main.o )
  14. 1.38 s [schema-dot-org-jsonld] [2 of 2] Linking Setup
  15. 2.53 s [schema-dot-org-jsonld] Phase: updateAutotoolsGnuConfigScriptsPhase
  16. 2.55 s [schema-dot-org-jsonld] Phase: configurePhase
  17. 2.56 s [schema-dot-org-jsonld] configureFlags: --verbose --prefix=/nix/store/8q2s09jza1l7wqhq4i0sqrkqmsx0ldiz-schema-dot-org-jsonld-0.0.0.0 --libdir=$prefix/lib/$compiler/lib --libsubdir=$abi/$libname --docdir=/nix/store/nicsxijpgvgpw191gz23d9r192p566w0-schema-dot-org-jsonld-0.0.0.0-doc/share/doc/schema-dot-org-jsonld-0.0.0.0 --with-gcc=gcc --package-db=/build/tmp.LNgiOeDdWd/package.conf.d --ghc-option=-j14 --ghc-option=+RTS --ghc-option=-A64M --ghc-option=-RTS --enable-library-profiling --profiling-detail=exported-functions --disable-profiling --enable-shared --disable-coverage --enable-static --disable-executable-dynamic --enable-tests --disable-benchmarks --enable-library-vanilla --disable-library-for-ghci --enable-split-sections --enable-library-stripping --enable-executable-stripping --ghc-option=-haddock --ghc-option=-Wall --ghc-option=-Werror --extra-lib-dirs=/nix/store/wl2nw5l4x4dg6kclbgpq7v9212i1s6cy-ncurses-6.6/lib --extra-lib-dirs=/nix/store/2zs4bbi72plfm8j6zxf1js4f3yc4yzwy-libffi-3.5.2/lib --extra-lib-dirs=/nix/store/qhmqdg27kcrlkl8ida6d5hiacw0y8d21-elfutils-0.194/lib --extra-lib-dirs=/nix/store/y56aqb1m3y5davn6hsv4jfbml78qw4mv-gmp-with-cxx-6.3.0/lib --extra-lib-dirs=/nix/store/wjfhh11sfcdf97mvg7hbxickybxzk850-numactl-2.0.18/lib
  18. 2.57 s [schema-dot-org-jsonld] Using Parsec parser
  19. 2.57 s [schema-dot-org-jsonld] Configuring schema-dot-org-jsonld-0.0.0.0...
  20. 3.28 s [schema-dot-org-jsonld] Dependency aeson: using aeson-2.2.4.1
  21. 3.28 s [schema-dot-org-jsonld] Dependency base >=4.7 && <5: using base-4.20.2.0
  22. 3.28 s [schema-dot-org-jsonld] Dependency bytestring: using bytestring-0.12.2.0
  23. 3.28 s [schema-dot-org-jsonld] Dependency schema-dot-org: using schema-dot-org-0.0.0.0
  24. 3.28 s [schema-dot-org-jsonld] Dependency tagsoup: using tagsoup-0.14.8
  25. 3.28 s [schema-dot-org-jsonld] Dependency text: using text-2.1.3
  26. 3.28 s [schema-dot-org-jsonld] Dependency vector: using vector-0.13.2.0
  27. 3.28 s [schema-dot-org-jsonld] Dependency aeson: using aeson-2.2.4.1
  28. 3.28 s [schema-dot-org-jsonld] Dependency base >=4.7 && <5: using base-4.20.2.0
  29. 3.28 s [schema-dot-org-jsonld] Dependency bytestring: using bytestring-0.12.2.0
  30. 3.28 s [schema-dot-org-jsonld] Dependency path: using path-0.9.6
  31. 3.28 s [schema-dot-org-jsonld] Dependency schema-dot-org-jsonld: using schema-dot-org-jsonld-0.0.0.0
  32. 3.28 s [schema-dot-org-jsonld] Dependency sydtest: using sydtest-0.20.0.1
  33. 3.28 s [schema-dot-org-jsonld] Dependency sydtest-aeson: using sydtest-aeson-0.2.0.1
  34. 3.28 s [schema-dot-org-jsonld] Source component graph:
  35. 3.28 s [schema-dot-org-jsonld] component lib
  36. 3.28 s [schema-dot-org-jsonld] component test:schema-dot-org-jsonld-test dependency lib
  37. 3.28 s [schema-dot-org-jsonld] Configured component graph:
  38. 3.28 s [schema-dot-org-jsonld] component schema-dot-org-jsonld-0.0.0.0-IFXBqy7zHoeF7tncdo1uxB
  39. 3.28 s [schema-dot-org-jsonld] include aeson-2.2.4.1-I5kgiCyiPJO8jEV0bEgUez
  40. 3.28 s [schema-dot-org-jsonld] include base-4.20.2.0-4d66
  41. 3.28 s [schema-dot-org-jsonld] include bytestring-0.12.2.0-25ef
  42. 3.28 s [schema-dot-org-jsonld] include schema-dot-org-0.0.0.0-DK3bNdhkDmvFOAaebGqsq5
  43. 3.28 s [schema-dot-org-jsonld] include tagsoup-0.14.8-BsqbPSEZh9W5mB1CzgSWho
  44. 3.28 s [schema-dot-org-jsonld] include text-2.1.3-3f03
  45. 3.28 s [schema-dot-org-jsonld] include vector-0.13.2.0-4sNODSde54Y5T3xVFmV0fE
  46. 3.28 s [schema-dot-org-jsonld] component schema-dot-org-jsonld-0.0.0.0-Cu5ewoR91fM6pMI6cAFpDW-schema-dot-org-jsonld-test
  47. 3.28 s [schema-dot-org-jsonld] include aeson-2.2.4.1-I5kgiCyiPJO8jEV0bEgUez
  48. 3.28 s [schema-dot-org-jsonld] include base-4.20.2.0-4d66
  49. 3.28 s [schema-dot-org-jsonld] include bytestring-0.12.2.0-25ef
  50. 3.28 s [schema-dot-org-jsonld] include path-0.9.6-L3t3TcndY3P7bshtU9371n
  51. 3.28 s [schema-dot-org-jsonld] include schema-dot-org-jsonld-0.0.0.0-IFXBqy7zHoeF7tncdo1uxB
  52. 3.28 s [schema-dot-org-jsonld] include sydtest-0.20.0.1-Jo2KtBwwg0M2hH86LVxxcs
  53. 3.28 s [schema-dot-org-jsonld] include sydtest-aeson-0.2.0.1-AEtebtKhgEIKIZK2rvdpfT
  54. 3.28 s [schema-dot-org-jsonld] Linked component graph:
  55. 3.28 s [schema-dot-org-jsonld] unit schema-dot-org-jsonld-0.0.0.0-IFXBqy7zHoeF7tncdo1uxB
  56. 3.28 s [schema-dot-org-jsonld] include aeson-2.2.4.1-I5kgiCyiPJO8jEV0bEgUez
  57. 3.28 s [schema-dot-org-jsonld] include base-4.20.2.0-4d66
  58. 3.28 s [schema-dot-org-jsonld] include bytestring-0.12.2.0-25ef
  59. 3.28 s [schema-dot-org-jsonld] include schema-dot-org-0.0.0.0-DK3bNdhkDmvFOAaebGqsq5
  60. 3.28 s [schema-dot-org-jsonld] include tagsoup-0.14.8-BsqbPSEZh9W5mB1CzgSWho
  61. 3.28 s [schema-dot-org-jsonld] include text-2.1.3-3f03
  62. 3.47 s [schema-dot-org-jsonld] include vector-0.13.2.0-4sNODSde54Y5T3xVFmV0fE
  63. 3.47 s [schema-dot-org-jsonld] SchemaDotOrg.JSONLD=schema-dot-org-jsonld-0.0.0.0-IFXBqy7zHoeF7tncdo1uxB:SchemaDotOrg.JSONLD,SchemaDotOrg.JSONLD.Parse=schema-dot-org-jsonld-0.0.0.0-IFXBqy7zHoeF7tncdo1uxB:SchemaDotOrg.JSONLD.Parse,SchemaDotOrg.JSONLD.Render=schema-dot-org-jsonld-0.0.0.0-IFXBqy7zHoeF7tncdo1uxB:SchemaDotOrg.JSONLD.Render,SchemaDotOrg.JSONLD.Tagsoup=schema-dot-org-jsonld-0.0.0.0-IFXBqy7zHoeF7tncdo1uxB:SchemaDotOrg.JSONLD.Tagsoup
  64. 3.47 s [schema-dot-org-jsonld] unit schema-dot-org-jsonld-0.0.0.0-Cu5ewoR91fM6pMI6cAFpDW-schema-dot-org-jsonld-test
  65. 3.47 s [schema-dot-org-jsonld] include aeson-2.2.4.1-I5kgiCyiPJO8jEV0bEgUez
  66. 3.47 s [schema-dot-org-jsonld] include base-4.20.2.0-4d66
  67. 3.47 s [schema-dot-org-jsonld] include bytestring-0.12.2.0-25ef
  68. 3.47 s [schema-dot-org-jsonld] include path-0.9.6-L3t3TcndY3P7bshtU9371n
  69. 3.47 s [schema-dot-org-jsonld] include schema-dot-org-jsonld-0.0.0.0-IFXBqy7zHoeF7tncdo1uxB
  70. 3.47 s [schema-dot-org-jsonld] include sydtest-0.20.0.1-Jo2KtBwwg0M2hH86LVxxcs
  71. 3.47 s [schema-dot-org-jsonld] include sydtest-aeson-0.2.0.1-AEtebtKhgEIKIZK2rvdpfT
  72. 3.47 s [schema-dot-org-jsonld] Ready component graph:
  73. 3.47 s [schema-dot-org-jsonld] definite schema-dot-org-jsonld-0.0.0.0-IFXBqy7zHoeF7tncdo1uxB
  74. 3.47 s [schema-dot-org-jsonld] depends aeson-2.2.4.1-I5kgiCyiPJO8jEV0bEgUez
  75. 3.47 s [schema-dot-org-jsonld] depends base-4.20.2.0-4d66
  76. 3.47 s [schema-dot-org-jsonld] depends bytestring-0.12.2.0-25ef
  77. 3.47 s [schema-dot-org-jsonld] depends schema-dot-org-0.0.0.0-DK3bNdhkDmvFOAaebGqsq5
  78. 3.47 s [schema-dot-org-jsonld] depends tagsoup-0.14.8-BsqbPSEZh9W5mB1CzgSWho
  79. 3.47 s [schema-dot-org-jsonld] depends text-2.1.3-3f03
  80. 3.47 s [schema-dot-org-jsonld] depends vector-0.13.2.0-4sNODSde54Y5T3xVFmV0fE
  81. 3.47 s [schema-dot-org-jsonld] definite schema-dot-org-jsonld-0.0.0.0-Cu5ewoR91fM6pMI6cAFpDW-schema-dot-org-jsonld-test
  82. 3.47 s [schema-dot-org-jsonld] depends aeson-2.2.4.1-I5kgiCyiPJO8jEV0bEgUez
  83. 3.47 s [schema-dot-org-jsonld] depends base-4.20.2.0-4d66
  84. 3.47 s [schema-dot-org-jsonld] depends bytestring-0.12.2.0-25ef
  85. 3.47 s [schema-dot-org-jsonld] depends path-0.9.6-L3t3TcndY3P7bshtU9371n
  86. 3.47 s [schema-dot-org-jsonld] depends schema-dot-org-jsonld-0.0.0.0-IFXBqy7zHoeF7tncdo1uxB
  87. 3.47 s [schema-dot-org-jsonld] depends sydtest-0.20.0.1-Jo2KtBwwg0M2hH86LVxxcs
  88. 3.47 s [schema-dot-org-jsonld] depends sydtest-aeson-0.2.0.1-AEtebtKhgEIKIZK2rvdpfT
  89. 3.47 s [schema-dot-org-jsonld] Using Cabal-3.12.1.0 compiled by ghc-9.10
  90. 3.47 s [schema-dot-org-jsonld] Using compiler: ghc-9.10.3
  91. 3.47 s [schema-dot-org-jsonld] Using install prefix:
  92. 3.47 s [schema-dot-org-jsonld] /nix/store/8q2s09jza1l7wqhq4i0sqrkqmsx0ldiz-schema-dot-org-jsonld-0.0.0.0
  93. 3.47 s [schema-dot-org-jsonld] Executables installed in:
  94. 3.47 s [schema-dot-org-jsonld] /nix/store/8q2s09jza1l7wqhq4i0sqrkqmsx0ldiz-schema-dot-org-jsonld-0.0.0.0/bin
  95. 3.47 s [schema-dot-org-jsonld] Libraries installed in:
  96. 3.47 s [schema-dot-org-jsonld] /nix/store/8q2s09jza1l7wqhq4i0sqrkqmsx0ldiz-schema-dot-org-jsonld-0.0.0.0/lib/ghc-9.10.3/lib/x86_64-linux-ghc-9.10.3-21af/schema-dot-org-jsonld-0.0.0.0-IFXBqy7zHoeF7tncdo1uxB
  97. 3.47 s [schema-dot-org-jsonld] Dynamic Libraries installed in:
  98. 3.47 s [schema-dot-org-jsonld] /nix/store/8q2s09jza1l7wqhq4i0sqrkqmsx0ldiz-schema-dot-org-jsonld-0.0.0.0/lib/ghc-9.10.3/lib/x86_64-linux-ghc-9.10.3-21af
  99. 3.47 s [schema-dot-org-jsonld] Private executables installed in:
  100. 3.47 s [schema-dot-org-jsonld] /nix/store/8q2s09jza1l7wqhq4i0sqrkqmsx0ldiz-schema-dot-org-jsonld-0.0.0.0/libexec/x86_64-linux-ghc-9.10.3-21af/schema-dot-org-jsonld-0.0.0.0
  101. 3.47 s [schema-dot-org-jsonld] Data files installed in:
  102. 3.47 s [schema-dot-org-jsonld] /nix/store/8q2s09jza1l7wqhq4i0sqrkqmsx0ldiz-schema-dot-org-jsonld-0.0.0.0/share/x86_64-linux-ghc-9.10.3-21af/schema-dot-org-jsonld-0.0.0.0
  103. 3.47 s [schema-dot-org-jsonld] Documentation installed in:
  104. 3.47 s [schema-dot-org-jsonld] /nix/store/nicsxijpgvgpw191gz23d9r192p566w0-schema-dot-org-jsonld-0.0.0.0-doc/share/doc/schema-dot-org-jsonld-0.0.0.0
  105. 3.47 s [schema-dot-org-jsonld] Configuration files installed in:
  106. 3.47 s [schema-dot-org-jsonld] /nix/store/8q2s09jza1l7wqhq4i0sqrkqmsx0ldiz-schema-dot-org-jsonld-0.0.0.0/etc
  107. 3.47 s [schema-dot-org-jsonld] No alex found
  108. 3.47 s [schema-dot-org-jsonld] Using ar found on system at:
  109. 3.47 s [schema-dot-org-jsonld] /nix/store/mbyy19mdwnfvfwmdi0gqgggx0njvpl1w-binutils-wrapper-2.46/bin/ar
  110. 3.47 s [schema-dot-org-jsonld] No c2hs found
  111. 3.47 s [schema-dot-org-jsonld] No cpphs found
  112. 3.47 s [schema-dot-org-jsonld] No doctest found
  113. 3.47 s [schema-dot-org-jsonld] Using gcc version 15.2.0 given by user at:
  114. 3.47 s [schema-dot-org-jsonld] /nix/store/788mx070y81zjlg5ipcl0cra3afviw9k-gcc-wrapper-15.2.0/bin/gcc
  115. 3.47 s [schema-dot-org-jsonld] Using ghc version 9.10.3 found on system at:
  116. 3.47 s [schema-dot-org-jsonld] /nix/store/k493jzz83044mqayvlb6247l35780kxy-ghc-9.10.3/bin/ghc
  117. 3.47 s [schema-dot-org-jsonld] Using ghc-pkg version 9.10.3 found on system at:
  118. 3.47 s [schema-dot-org-jsonld] /nix/store/k493jzz83044mqayvlb6247l35780kxy-ghc-9.10.3/bin/ghc-pkg-9.10.3
  119. 3.47 s [schema-dot-org-jsonld] No ghcjs found
  120. 3.47 s [schema-dot-org-jsonld] No ghcjs-pkg found
  121. 3.47 s [schema-dot-org-jsonld] No greencard found
  122. 3.47 s [schema-dot-org-jsonld] Using haddock version 2.31.1 found on system at:
  123. 3.47 s [schema-dot-org-jsonld] /nix/store/k493jzz83044mqayvlb6247l35780kxy-ghc-9.10.3/bin/haddock-ghc-9.10.3
  124. 3.47 s [schema-dot-org-jsonld] No happy found
  125. 3.47 s [schema-dot-org-jsonld] Using haskell-suite found on system at: haskell-suite-dummy-location
  126. 3.47 s [schema-dot-org-jsonld] Using haskell-suite-pkg found on system at: haskell-suite-pkg-dummy-location
  127. 3.47 s [schema-dot-org-jsonld] No hmake found
  128. 3.47 s [schema-dot-org-jsonld] Using hpc version 0.69 found on system at:
  129. 3.47 s [schema-dot-org-jsonld] /nix/store/k493jzz83044mqayvlb6247l35780kxy-ghc-9.10.3/bin/hpc-ghc-9.10.3
  130. 3.47 s [schema-dot-org-jsonld] Using hsc2hs version 0.68.10 found on system at:
  131. 3.47 s [schema-dot-org-jsonld] /nix/store/k493jzz83044mqayvlb6247l35780kxy-ghc-9.10.3/bin/hsc2hs-ghc-9.10.3
  132. 3.47 s [schema-dot-org-jsonld] Using hscolour version 1.25 found on system at:
  133. 3.47 s [schema-dot-org-jsonld] /nix/store/hvlf3xzdw0p5s3kybdkch6iqyz0740rc-hscolour-1.25/bin/HsColour
  134. 3.47 s [schema-dot-org-jsonld] No jhc found
  135. 3.47 s [schema-dot-org-jsonld] Using ld found on system at:
  136. 3.47 s [schema-dot-org-jsonld] /nix/store/788mx070y81zjlg5ipcl0cra3afviw9k-gcc-wrapper-15.2.0/bin/ld
  137. 3.47 s [schema-dot-org-jsonld] No pkg-config found
  138. 3.47 s [schema-dot-org-jsonld] Using runghc version 9.10.3 found on system at:
  139. 3.47 s [schema-dot-org-jsonld] /nix/store/k493jzz83044mqayvlb6247l35780kxy-ghc-9.10.3/bin/runghc-9.10.3
  140. 3.47 s [schema-dot-org-jsonld] Using strip version 2.46 found on system at:
  141. 3.47 s [schema-dot-org-jsonld] /nix/store/788mx070y81zjlg5ipcl0cra3afviw9k-gcc-wrapper-15.2.0/bin/strip
  142. 3.47 s [schema-dot-org-jsonld] Using tar found on system at:
  143. 3.47 s [schema-dot-org-jsonld] /nix/store/k5akwnrn9x2afaj2va7g4a2zpdim8l43-gnutar-1.35/bin/tar
  144. 3.47 s [schema-dot-org-jsonld] No uhc found
  145. 4.28 s [schema-dot-org-jsonld] Phase: buildPhase
  146. 4.35 s [schema-dot-org-jsonld] Preprocessing library for schema-dot-org-jsonld-0.0.0.0...
  147. 4.35 s [schema-dot-org-jsonld] Building library for schema-dot-org-jsonld-0.0.0.0...
  148. 4.44 s [schema-dot-org-jsonld] [1 of 5] Compiling Paths_schema_dot_org_jsonld ( dist/build/autogen/Paths_schema_dot_org_jsonld.hs, dist/build/Paths_schema_dot_org_jsonld.o, dist/build/Paths_schema_dot_org_jsonld.dyn_o )
  149. 4.59 s [schema-dot-org-jsonld] [2 of 5] Compiling SchemaDotOrg.JSONLD.Parse ( src/SchemaDotOrg/JSONLD/Parse.hs, dist/build/SchemaDotOrg/JSONLD/Parse.o, dist/build/SchemaDotOrg/JSONLD/Parse.dyn_o )
  150. 5.08 s [schema-dot-org-jsonld] [3 of 5] Compiling SchemaDotOrg.JSONLD.Render ( src/SchemaDotOrg/JSONLD/Render.hs, dist/build/SchemaDotOrg/JSONLD/Render.o, dist/build/SchemaDotOrg/JSONLD/Render.dyn_o )
  151. 5.08 s [schema-dot-org-jsonld] [4 of 5] Compiling SchemaDotOrg.JSONLD.Tagsoup ( src/SchemaDotOrg/JSONLD/Tagsoup.hs, dist/build/SchemaDotOrg/JSONLD/Tagsoup.o, dist/build/SchemaDotOrg/JSONLD/Tagsoup.dyn_o )
  152. 5.16 s [schema-dot-org-jsonld] [5 of 5] Compiling SchemaDotOrg.JSONLD ( src/SchemaDotOrg/JSONLD.hs, dist/build/SchemaDotOrg/JSONLD.o, dist/build/SchemaDotOrg/JSONLD.dyn_o )
  153. 5.39 s [schema-dot-org-jsonld] [1 of 5] Compiling Paths_schema_dot_org_jsonld ( dist/build/autogen/Paths_schema_dot_org_jsonld.hs, dist/build/Paths_schema_dot_org_jsonld.p_o )
  154. 5.67 s [schema-dot-org-jsonld] [2 of 5] Compiling SchemaDotOrg.JSONLD.Parse ( src/SchemaDotOrg/JSONLD/Parse.hs, dist/build/SchemaDotOrg/JSONLD/Parse.p_o )
  155. 6.13 s [schema-dot-org-jsonld] [3 of 5] Compiling SchemaDotOrg.JSONLD.Render ( src/SchemaDotOrg/JSONLD/Render.hs, dist/build/SchemaDotOrg/JSONLD/Render.p_o )
  156. 6.13 s [schema-dot-org-jsonld] [4 of 5] Compiling SchemaDotOrg.JSONLD.Tagsoup ( src/SchemaDotOrg/JSONLD/Tagsoup.hs, dist/build/SchemaDotOrg/JSONLD/Tagsoup.p_o )
  157. 6.24 s [schema-dot-org-jsonld] [5 of 5] Compiling SchemaDotOrg.JSONLD ( src/SchemaDotOrg/JSONLD.hs, dist/build/SchemaDotOrg/JSONLD.p_o )
  158. 8.20 s [schema-dot-org-jsonld] Preprocessing test suite 'schema-dot-org-jsonld-test' for schema-dot-org-jsonld-0.0.0.0...
  159. 8.20 s [schema-dot-org-jsonld] Building test suite 'schema-dot-org-jsonld-test' for schema-dot-org-jsonld-0.0.0.0...
  160. 8.31 s [schema-dot-org-jsonld] [1 of 3] Compiling Paths_schema_dot_org_jsonld ( dist/build/schema-dot-org-jsonld-test/autogen/Paths_schema_dot_org_jsonld.hs, dist/build/schema-dot-org-jsonld-test/schema-dot-org-jsonld-test-tmp/Paths_schema_dot_org_jsonld.o )
  161. 8.41 s [schema-dot-org-jsonld] [2 of 3] Compiling SchemaDotOrg.JSONLD.TagsoupSpec ( test/SchemaDotOrg/JSONLD/TagsoupSpec.hs, dist/build/schema-dot-org-jsonld-test/schema-dot-org-jsonld-test-tmp/SchemaDotOrg/JSONLD/TagsoupSpec.o )
  162. 8.48 s [schema-dot-org-jsonld] test/SchemaDotOrg/JSONLD/TagsoupSpec.hs:33:25: error: [GHC-83865]
  163. 8.48 s [schema-dot-org-jsonld] • Couldn't match type: Path.Internal.Posix.Path
  164. 8.48 s [schema-dot-org-jsonld] Path.Posix.Rel Path.Posix.Dir
  165. 8.48 s [schema-dot-org-jsonld] with: [Char]
  166. 8.48 s [schema-dot-org-jsonld] Expected: FilePath
  167. 8.48 s [schema-dot-org-jsonld] Actual: Path.Internal.Posix.Path Path.Posix.Rel Path.Posix.Dir
  168. 8.48 s [schema-dot-org-jsonld] • In the first argument of ‘scenarioDir’, namely
  169. 8.48 s [schema-dot-org-jsonld] ‘(Path.Internal.Posix.Path "test_resources/" ::
  170. 8.48 s [schema-dot-org-jsonld] Path.Internal.Posix.Path Path.Posix.Rel Path.Posix.Dir)’
  171. 8.48 s [schema-dot-org-jsonld] In the first argument of ‘($)’, namely
  172. 8.48 s [schema-dot-org-jsonld] ‘scenarioDir
  173. 8.48 s [schema-dot-org-jsonld] (Path.Internal.Posix.Path "test_resources/" ::
  174. 8.48 s [schema-dot-org-jsonld] Path.Internal.Posix.Path Path.Posix.Rel Path.Posix.Dir)’
  175. 8.48 s [schema-dot-org-jsonld] In the second argument of ‘($)’, namely
  176. 8.48 s [schema-dot-org-jsonld] ‘scenarioDir
  177. 8.48 s [schema-dot-org-jsonld] (Path.Internal.Posix.Path "test_resources/" ::
  178. 8.48 s [schema-dot-org-jsonld] Path.Internal.Posix.Path Path.Posix.Rel Path.Posix.Dir)
  179. 8.48 s [schema-dot-org-jsonld] $ \ file
  180. 8.48 s [schema-dot-org-jsonld] -> when (fileExtension file == Just ".html")
  181. 8.48 s [schema-dot-org-jsonld] $ do let ...
  182. 8.48 s [schema-dot-org-jsonld] it (unwords [...]) $ do ...’
  183. 8.48 s [schema-dot-org-jsonld] |
  184. 8.48 s [schema-dot-org-jsonld] 33 | scenarioDir [reldir|test_resources|] $ \file ->
  185. 8.48 s [schema-dot-org-jsonld] | ^^^^^^^^^^^^^^^^
  186. 8.48 s [schema-dot-org-jsonld]
  187. 8.48 s [schema-dot-org-jsonld] test/SchemaDotOrg/JSONLD/TagsoupSpec.hs:34:27: error: [GHC-83865]
  188. 8.48 s [schema-dot-org-jsonld] • Couldn't match type: [Char]
  189. 8.48 s [schema-dot-org-jsonld] with: Path.Internal.Posix.Path b0 Path.Posix.File
  190. 8.48 s [schema-dot-org-jsonld] Expected: Path.Internal.Posix.Path b0 Path.Posix.File
  191. 8.48 s [schema-dot-org-jsonld] Actual: FilePath
  192. 8.48 s [schema-dot-org-jsonld] • In the first argument of ‘fileExtension’, namely ‘file’
  193. 8.48 s [schema-dot-org-jsonld] In the first argument of ‘(==)’, namely ‘fileExtension file’
  194. 8.48 s [schema-dot-org-jsonld] In the first argument of ‘when’, namely
  195. 8.48 s [schema-dot-org-jsonld] ‘(fileExtension file == Just ".html")’
  196. 8.48 s [schema-dot-org-jsonld] |
  197. 8.48 s [schema-dot-org-jsonld] 34 | when (fileExtension file == Just ".html") $ do
  198. 8.48 s [schema-dot-org-jsonld] | ^^^^
  199. 8.48 s [schema-dot-org-jsonld]
  200. 8.48 s [schema-dot-org-jsonld] test/SchemaDotOrg/JSONLD/TagsoupSpec.hs:35:30: error: [GHC-83865]
  201. 8.48 s [schema-dot-org-jsonld] • Couldn't match type: [Char]
  202. 8.48 s [schema-dot-org-jsonld] with: Path.Internal.Posix.Path Path.Posix.Rel Path.Posix.File
  203. 8.48 s [schema-dot-org-jsonld] Expected: Path.Internal.Posix.Path Path.Posix.Rel Path.Posix.File
  204. 8.48 s [schema-dot-org-jsonld] Actual: FilePath
  205. 8.48 s [schema-dot-org-jsonld] • In the first argument of ‘fromRelFile’, namely ‘file’
  206. 8.48 s [schema-dot-org-jsonld] In the expression: fromRelFile file
  207. 8.48 s [schema-dot-org-jsonld] In an equation for ‘fp’: fp = fromRelFile file
  208. 8.48 s [schema-dot-org-jsonld] |
  209. 8.48 s [schema-dot-org-jsonld] 35 | let fp = fromRelFile file
  210. 8.48 s [schema-dot-org-jsonld] | ^^^^
  211. 8.48 s [schema-dot-org-jsonld]
  212. 8.77 s Progress: 0 of 1 built (1 failed)
  213. 8.77 s Failed to build schema-dot-org-jsonld after 8.5s
  214. 8.78 s Cannot build '/nix/store/b7wxkz1av6hmgals5h16625kcxfjpvyg-schema-dot-org-jsonld-0.0.0.0.drv'.
  215. 8.78 s Reason: builder failed with exit code 1.
  216. 8.78 s Output paths:
  217. 8.78 s /nix/store/8q2s09jza1l7wqhq4i0sqrkqmsx0ldiz-schema-dot-org-jsonld-0.0.0.0
  218. 8.78 s /nix/store/nicsxijpgvgpw191gz23d9r192p566w0-schema-dot-org-jsonld-0.0.0.0-doc
  219. 8.78 s Last 208 log lines:
  220. 8.78 s > Running phase: setupCompilerEnvironmentPhase
  221. 8.78 s > Build with /nix/store/k493jzz83044mqayvlb6247l35780kxy-ghc-9.10.3.
  222. 8.78 s > Running phase: unpackPhase
  223. 8.78 s > unpacking source archive /nix/store/9q5dm03axrmxqhm6x7iqpyv5947n8j8l-schema-dot-org-jsonld-source-0.0.0.0/schema-dot-org-jsonld-0.0.0.0.tar.gz
  224. 8.78 s > source root is schema-dot-org-jsonld-0.0.0.0
  225. 8.78 s > setting SOURCE_DATE_EPOCH to timestamp 1788936908 of file "schema-dot-org-jsonld-0.0.0.0/test/Spec.hs"
  226. 8.78 s > Running phase: patchPhase
  227. 8.78 s > Running phase: compileBuildDriverPhase
  228. 8.78 s > setupCompileFlags: -package-db=/build/tmp.LNgiOeDdWd/setup-package.conf.d -threaded
  229. 8.78 s > [1 of 2] Compiling Main ( Setup.hs, /build/tmp.LNgiOeDdWd/Main.o )
  230. 8.78 s > [2 of 2] Linking Setup
  231. 8.78 s > Running phase: updateAutotoolsGnuConfigScriptsPhase
  232. 8.78 s > Running phase: configurePhase
  233. 8.78 s > configureFlags: --verbose --prefix=/nix/store/8q2s09jza1l7wqhq4i0sqrkqmsx0ldiz-schema-dot-org-jsonld-0.0.0.0 --libdir=$prefix/lib/$compiler/lib --libsubdir=$abi/$libname --docdir=/nix/store/nicsxijpgvgpw191gz23d9r192p566w0-schema-dot-org-jsonld-0.0.0.0-doc/share/doc/schema-dot-org-jsonld-0.0.0.0 --with-gcc=gcc --package-db=/build/tmp.LNgiOeDdWd/package.conf.d --ghc-option=-j14 --ghc-option=+RTS --ghc-option=-A64M --ghc-option=-RTS --enable-library-profiling --profiling-detail=exported-functions --disable-profiling --enable-shared --disable-coverage --enable-static --disable-executable-dynamic --enable-tests --disable-benchmarks --enable-library-vanilla --disable-library-for-ghci --enable-split-sections --enable-library-stripping --enable-executable-stripping --ghc-option=-haddock --ghc-option=-Wall --ghc-option=-Werror --extra-lib-dirs=/nix/store/wl2nw5l4x4dg6kclbgpq7v9212i1s6cy-ncurses-6.6/lib --extra-lib-dirs=/nix/store/2zs4bbi72plfm8j6zxf1js4f3yc4yzwy-libffi-3.5.2/lib --extra-lib-dirs=/nix/store/qhmqdg27kcrlkl8ida6d5hiacw0y8d21-elfutils-0.194/lib --extra-lib-dirs=/nix/store/y56aqb1m3y5davn6hsv4jfbml78qw4mv-gmp-with-cxx-6.3.0/lib --extra-lib-dirs=/nix/store/wjfhh11sfcdf97mvg7hbxickybxzk850-numactl-2.0.18/lib
  234. 8.78 s > Using Parsec parser
  235. 8.78 s > Configuring schema-dot-org-jsonld-0.0.0.0...
  236. 8.78 s > Dependency aeson: using aeson-2.2.4.1
  237. 8.78 s > Dependency base >=4.7 && <5: using base-4.20.2.0
  238. 8.78 s > Dependency bytestring: using bytestring-0.12.2.0
  239. 8.78 s > Dependency schema-dot-org: using schema-dot-org-0.0.0.0
  240. 8.78 s > Dependency tagsoup: using tagsoup-0.14.8
  241. 8.78 s > Dependency text: using text-2.1.3
  242. 8.78 s > Dependency vector: using vector-0.13.2.0
  243. 8.78 s > Dependency aeson: using aeson-2.2.4.1
  244. 8.78 s > Dependency base >=4.7 && <5: using base-4.20.2.0
  245. 8.78 s > Dependency bytestring: using bytestring-0.12.2.0
  246. 8.78 s > Dependency path: using path-0.9.6
  247. 8.78 s > Dependency schema-dot-org-jsonld: using schema-dot-org-jsonld-0.0.0.0
  248. 8.78 s > Dependency sydtest: using sydtest-0.20.0.1
  249. 8.78 s > Dependency sydtest-aeson: using sydtest-aeson-0.2.0.1
  250. 8.78 s > Source component graph:
  251. 8.78 s > component lib
  252. 8.78 s > component test:schema-dot-org-jsonld-test dependency lib
  253. 8.78 s > Configured component graph:
  254. 8.78 s > component schema-dot-org-jsonld-0.0.0.0-IFXBqy7zHoeF7tncdo1uxB
  255. 8.78 s > include aeson-2.2.4.1-I5kgiCyiPJO8jEV0bEgUez
  256. 8.78 s > include base-4.20.2.0-4d66
  257. 8.78 s > include bytestring-0.12.2.0-25ef
  258. 8.78 s > include schema-dot-org-0.0.0.0-DK3bNdhkDmvFOAaebGqsq5
  259. 8.78 s > include tagsoup-0.14.8-BsqbPSEZh9W5mB1CzgSWho
  260. 8.78 s > include text-2.1.3-3f03
  261. 8.78 s > include vector-0.13.2.0-4sNODSde54Y5T3xVFmV0fE
  262. 8.78 s > component schema-dot-org-jsonld-0.0.0.0-Cu5ewoR91fM6pMI6cAFpDW-schema-dot-org-jsonld-test
  263. 8.78 s > include aeson-2.2.4.1-I5kgiCyiPJO8jEV0bEgUez
  264. 8.78 s > include base-4.20.2.0-4d66
  265. 8.78 s > include bytestring-0.12.2.0-25ef
  266. 8.78 s > include path-0.9.6-L3t3TcndY3P7bshtU9371n
  267. 8.78 s > include schema-dot-org-jsonld-0.0.0.0-IFXBqy7zHoeF7tncdo1uxB
  268. 8.78 s > include sydtest-0.20.0.1-Jo2KtBwwg0M2hH86LVxxcs
  269. 8.78 s > include sydtest-aeson-0.2.0.1-AEtebtKhgEIKIZK2rvdpfT
  270. 8.78 s > Linked component graph:
  271. 8.78 s > unit schema-dot-org-jsonld-0.0.0.0-IFXBqy7zHoeF7tncdo1uxB
  272. 8.78 s > include aeson-2.2.4.1-I5kgiCyiPJO8jEV0bEgUez
  273. 8.78 s > include base-4.20.2.0-4d66
  274. 8.78 s > include bytestring-0.12.2.0-25ef
  275. 8.78 s > include schema-dot-org-0.0.0.0-DK3bNdhkDmvFOAaebGqsq5
  276. 8.78 s > include tagsoup-0.14.8-BsqbPSEZh9W5mB1CzgSWho
  277. 8.78 s > include text-2.1.3-3f03
  278. 8.78 s > include vector-0.13.2.0-4sNODSde54Y5T3xVFmV0fE
  279. 8.78 s > SchemaDotOrg.JSONLD=schema-dot-org-jsonld-0.0.0.0-IFXBqy7zHoeF7tncdo1uxB:SchemaDotOrg.JSONLD,SchemaDotOrg.JSONLD.Parse=schema-dot-org-jsonld-0.0.0.0-IFXBqy7zHoeF7tncdo1uxB:SchemaDotOrg.JSONLD.Parse,SchemaDotOrg.JSONLD.Render=schema-dot-org-jsonld-0.0.0.0-IFXBqy7zHoeF7tncdo1uxB:SchemaDotOrg.JSONLD.Render,SchemaDotOrg.JSONLD.Tagsoup=schema-dot-org-jsonld-0.0.0.0-IFXBqy7zHoeF7tncdo1uxB:SchemaDotOrg.JSONLD.Tagsoup
  280. 8.78 s > unit schema-dot-org-jsonld-0.0.0.0-Cu5ewoR91fM6pMI6cAFpDW-schema-dot-org-jsonld-test
  281. 8.78 s > include aeson-2.2.4.1-I5kgiCyiPJO8jEV0bEgUez
  282. 8.78 s > include base-4.20.2.0-4d66
  283. 8.78 s > include bytestring-0.12.2.0-25ef
  284. 8.78 s > include path-0.9.6-L3t3TcndY3P7bshtU9371n
  285. 8.78 s > include schema-dot-org-jsonld-0.0.0.0-IFXBqy7zHoeF7tncdo1uxB
  286. 8.78 s > include sydtest-0.20.0.1-Jo2KtBwwg0M2hH86LVxxcs
  287. 8.78 s > include sydtest-aeson-0.2.0.1-AEtebtKhgEIKIZK2rvdpfT
  288. 8.78 s > Ready component graph:
  289. 8.78 s > definite schema-dot-org-jsonld-0.0.0.0-IFXBqy7zHoeF7tncdo1uxB
  290. 8.78 s > depends aeson-2.2.4.1-I5kgiCyiPJO8jEV0bEgUez
  291. 8.78 s > depends base-4.20.2.0-4d66
  292. 8.78 s > depends bytestring-0.12.2.0-25ef
  293. 8.78 s > depends schema-dot-org-0.0.0.0-DK3bNdhkDmvFOAaebGqsq5
  294. 8.78 s > depends tagsoup-0.14.8-BsqbPSEZh9W5mB1CzgSWho
  295. 8.78 s > depends text-2.1.3-3f03
  296. 8.78 s > depends vector-0.13.2.0-4sNODSde54Y5T3xVFmV0fE
  297. 8.78 s > definite schema-dot-org-jsonld-0.0.0.0-Cu5ewoR91fM6pMI6cAFpDW-schema-dot-org-jsonld-test
  298. 8.78 s > depends aeson-2.2.4.1-I5kgiCyiPJO8jEV0bEgUez
  299. 8.78 s > depends base-4.20.2.0-4d66
  300. 8.78 s > depends bytestring-0.12.2.0-25ef
  301. 8.78 s > depends path-0.9.6-L3t3TcndY3P7bshtU9371n
  302. 8.78 s > depends schema-dot-org-jsonld-0.0.0.0-IFXBqy7zHoeF7tncdo1uxB
  303. 8.78 s > depends sydtest-0.20.0.1-Jo2KtBwwg0M2hH86LVxxcs
  304. 8.78 s > depends sydtest-aeson-0.2.0.1-AEtebtKhgEIKIZK2rvdpfT
  305. 8.78 s > Using Cabal-3.12.1.0 compiled by ghc-9.10
  306. 8.78 s > Using compiler: ghc-9.10.3
  307. 8.78 s > Using install prefix:
  308. 8.78 s > /nix/store/8q2s09jza1l7wqhq4i0sqrkqmsx0ldiz-schema-dot-org-jsonld-0.0.0.0
  309. 8.78 s > Executables installed in:
  310. 8.78 s > /nix/store/8q2s09jza1l7wqhq4i0sqrkqmsx0ldiz-schema-dot-org-jsonld-0.0.0.0/bin
  311. 8.78 s > Libraries installed in:
  312. 8.78 s > /nix/store/8q2s09jza1l7wqhq4i0sqrkqmsx0ldiz-schema-dot-org-jsonld-0.0.0.0/lib/ghc-9.10.3/lib/x86_64-linux-ghc-9.10.3-21af/schema-dot-org-jsonld-0.0.0.0-IFXBqy7zHoeF7tncdo1uxB
  313. 8.78 s > Dynamic Libraries installed in:
  314. 8.78 s > /nix/store/8q2s09jza1l7wqhq4i0sqrkqmsx0ldiz-schema-dot-org-jsonld-0.0.0.0/lib/ghc-9.10.3/lib/x86_64-linux-ghc-9.10.3-21af
  315. 8.78 s > Private executables installed in:
  316. 8.78 s > /nix/store/8q2s09jza1l7wqhq4i0sqrkqmsx0ldiz-schema-dot-org-jsonld-0.0.0.0/libexec/x86_64-linux-ghc-9.10.3-21af/schema-dot-org-jsonld-0.0.0.0
  317. 8.78 s > Data files installed in:
  318. 8.78 s > /nix/store/8q2s09jza1l7wqhq4i0sqrkqmsx0ldiz-schema-dot-org-jsonld-0.0.0.0/share/x86_64-linux-ghc-9.10.3-21af/schema-dot-org-jsonld-0.0.0.0
  319. 8.78 s > Documentation installed in:
  320. 8.78 s > /nix/store/nicsxijpgvgpw191gz23d9r192p566w0-schema-dot-org-jsonld-0.0.0.0-doc/share/doc/schema-dot-org-jsonld-0.0.0.0
  321. 8.78 s > Configuration files installed in:
  322. 8.78 s > /nix/store/8q2s09jza1l7wqhq4i0sqrkqmsx0ldiz-schema-dot-org-jsonld-0.0.0.0/etc
  323. 8.78 s > No alex found
  324. 8.78 s > Using ar found on system at:
  325. 8.78 s > /nix/store/mbyy19mdwnfvfwmdi0gqgggx0njvpl1w-binutils-wrapper-2.46/bin/ar
  326. 8.78 s > No c2hs found
  327. 8.78 s > No cpphs found
  328. 8.78 s > No doctest found
  329. 8.78 s > Using gcc version 15.2.0 given by user at:
  330. 8.78 s > /nix/store/788mx070y81zjlg5ipcl0cra3afviw9k-gcc-wrapper-15.2.0/bin/gcc
  331. 8.78 s > Using ghc version 9.10.3 found on system at:
  332. 8.78 s > /nix/store/k493jzz83044mqayvlb6247l35780kxy-ghc-9.10.3/bin/ghc
  333. 8.78 s > Using ghc-pkg version 9.10.3 found on system at:
  334. 8.78 s > /nix/store/k493jzz83044mqayvlb6247l35780kxy-ghc-9.10.3/bin/ghc-pkg-9.10.3
  335. 8.78 s > No ghcjs found
  336. 8.78 s > No ghcjs-pkg found
  337. 8.78 s > No greencard found
  338. 8.78 s > Using haddock version 2.31.1 found on system at:
  339. 8.78 s > /nix/store/k493jzz83044mqayvlb6247l35780kxy-ghc-9.10.3/bin/haddock-ghc-9.10.3
  340. 8.78 s > No happy found
  341. 8.78 s > Using haskell-suite found on system at: haskell-suite-dummy-location
  342. 8.78 s > Using haskell-suite-pkg found on system at: haskell-suite-pkg-dummy-location
  343. 8.78 s > No hmake found
  344. 8.78 s > Using hpc version 0.69 found on system at:
  345. 8.78 s > /nix/store/k493jzz83044mqayvlb6247l35780kxy-ghc-9.10.3/bin/hpc-ghc-9.10.3
  346. 8.78 s > Using hsc2hs version 0.68.10 found on system at:
  347. 8.78 s > /nix/store/k493jzz83044mqayvlb6247l35780kxy-ghc-9.10.3/bin/hsc2hs-ghc-9.10.3
  348. 8.78 s > Using hscolour version 1.25 found on system at:
  349. 8.78 s > /nix/store/hvlf3xzdw0p5s3kybdkch6iqyz0740rc-hscolour-1.25/bin/HsColour
  350. 8.78 s > No jhc found
  351. 8.78 s > Using ld found on system at:
  352. 8.78 s > /nix/store/788mx070y81zjlg5ipcl0cra3afviw9k-gcc-wrapper-15.2.0/bin/ld
  353. 8.78 s > No pkg-config found
  354. 8.78 s > Using runghc version 9.10.3 found on system at:
  355. 8.78 s > /nix/store/k493jzz83044mqayvlb6247l35780kxy-ghc-9.10.3/bin/runghc-9.10.3
  356. 8.78 s > Using strip version 2.46 found on system at:
  357. 8.78 s > /nix/store/788mx070y81zjlg5ipcl0cra3afviw9k-gcc-wrapper-15.2.0/bin/strip
  358. 8.78 s > Using tar found on system at:
  359. 8.78 s > /nix/store/k5akwnrn9x2afaj2va7g4a2zpdim8l43-gnutar-1.35/bin/tar
  360. 8.78 s > No uhc found
  361. 8.78 s > Running phase: buildPhase
  362. 8.78 s > Preprocessing library for schema-dot-org-jsonld-0.0.0.0...
  363. 8.78 s > Building library for schema-dot-org-jsonld-0.0.0.0...
  364. 8.78 s > [1 of 5] Compiling Paths_schema_dot_org_jsonld ( dist/build/autogen/Paths_schema_dot_org_jsonld.hs, dist/build/Paths_schema_dot_org_jsonld.o, dist/build/Paths_schema_dot_org_jsonld.dyn_o )
  365. 8.78 s > [2 of 5] Compiling SchemaDotOrg.JSONLD.Parse ( src/SchemaDotOrg/JSONLD/Parse.hs, dist/build/SchemaDotOrg/JSONLD/Parse.o, dist/build/SchemaDotOrg/JSONLD/Parse.dyn_o )
  366. 8.78 s > [3 of 5] Compiling SchemaDotOrg.JSONLD.Render ( src/SchemaDotOrg/JSONLD/Render.hs, dist/build/SchemaDotOrg/JSONLD/Render.o, dist/build/SchemaDotOrg/JSONLD/Render.dyn_o )
  367. 8.78 s > [4 of 5] Compiling SchemaDotOrg.JSONLD.Tagsoup ( src/SchemaDotOrg/JSONLD/Tagsoup.hs, dist/build/SchemaDotOrg/JSONLD/Tagsoup.o, dist/build/SchemaDotOrg/JSONLD/Tagsoup.dyn_o )
  368. 8.78 s > [5 of 5] Compiling SchemaDotOrg.JSONLD ( src/SchemaDotOrg/JSONLD.hs, dist/build/SchemaDotOrg/JSONLD.o, dist/build/SchemaDotOrg/JSONLD.dyn_o )
  369. 8.78 s > [1 of 5] Compiling Paths_schema_dot_org_jsonld ( dist/build/autogen/Paths_schema_dot_org_jsonld.hs, dist/build/Paths_schema_dot_org_jsonld.p_o )
  370. 8.78 s > [2 of 5] Compiling SchemaDotOrg.JSONLD.Parse ( src/SchemaDotOrg/JSONLD/Parse.hs, dist/build/SchemaDotOrg/JSONLD/Parse.p_o )
  371. 8.78 s > [3 of 5] Compiling SchemaDotOrg.JSONLD.Render ( src/SchemaDotOrg/JSONLD/Render.hs, dist/build/SchemaDotOrg/JSONLD/Render.p_o )
  372. 8.78 s > [4 of 5] Compiling SchemaDotOrg.JSONLD.Tagsoup ( src/SchemaDotOrg/JSONLD/Tagsoup.hs, dist/build/SchemaDotOrg/JSONLD/Tagsoup.p_o )
  373. 8.78 s > [5 of 5] Compiling SchemaDotOrg.JSONLD ( src/SchemaDotOrg/JSONLD.hs, dist/build/SchemaDotOrg/JSONLD.p_o )
  374. 8.78 s > Preprocessing test suite 'schema-dot-org-jsonld-test' for schema-dot-org-jsonld-0.0.0.0...
  375. 8.78 s > Building test suite 'schema-dot-org-jsonld-test' for schema-dot-org-jsonld-0.0.0.0...
  376. 8.78 s > [1 of 3] Compiling Paths_schema_dot_org_jsonld ( dist/build/schema-dot-org-jsonld-test/autogen/Paths_schema_dot_org_jsonld.hs, dist/build/schema-dot-org-jsonld-test/schema-dot-org-jsonld-test-tmp/Paths_schema_dot_org_jsonld.o )
  377. 8.78 s > [2 of 3] Compiling SchemaDotOrg.JSONLD.TagsoupSpec ( test/SchemaDotOrg/JSONLD/TagsoupSpec.hs, dist/build/schema-dot-org-jsonld-test/schema-dot-org-jsonld-test-tmp/SchemaDotOrg/JSONLD/TagsoupSpec.o )
  378. 8.78 s > test/SchemaDotOrg/JSONLD/TagsoupSpec.hs:33:25: error: [GHC-83865]
  379. 8.78 s > • Couldn't match type: Path.Internal.Posix.Path
  380. 8.78 s > Path.Posix.Rel Path.Posix.Dir
  381. 8.78 s > with: [Char]
  382. 8.78 s > Expected: FilePath
  383. 8.78 s > Actual: Path.Internal.Posix.Path Path.Posix.Rel Path.Posix.Dir
  384. 8.78 s > • In the first argument of ‘scenarioDir’, namely
  385. 8.78 s > ‘(Path.Internal.Posix.Path "test_resources/" ::
  386. 8.78 s > Path.Internal.Posix.Path Path.Posix.Rel Path.Posix.Dir)’
  387. 8.78 s > In the first argument of ‘($)’, namely
  388. 8.78 s > ‘scenarioDir
  389. 8.78 s > (Path.Internal.Posix.Path "test_resources/" ::
  390. 8.78 s > Path.Internal.Posix.Path Path.Posix.Rel Path.Posix.Dir)’
  391. 8.78 s > In the second argument of ‘($)’, namely
  392. 8.78 s > ‘scenarioDir
  393. 8.78 s > (Path.Internal.Posix.Path "test_resources/" ::
  394. 8.78 s > Path.Internal.Posix.Path Path.Posix.Rel Path.Posix.Dir)
  395. 8.78 s > $ \ file
  396. 8.78 s > -> when (fileExtension file == Just ".html")
  397. 8.78 s > $ do let ...
  398. 8.78 s > it (unwords [...]) $ do ...’
  399. 8.78 s > |
  400. 8.78 s > 33 | scenarioDir [reldir|test_resources|] $ \file ->
  401. 8.78 s > | ^^^^^^^^^^^^^^^^
  402. 8.78 s >
  403. 8.78 s > test/SchemaDotOrg/JSONLD/TagsoupSpec.hs:34:27: error: [GHC-83865]
  404. 8.78 s > • Couldn't match type: [Char]
  405. 8.78 s > with: Path.Internal.Posix.Path b0 Path.Posix.File
  406. 8.78 s > Expected: Path.Internal.Posix.Path b0 Path.Posix.File
  407. 8.78 s > Actual: FilePath
  408. 8.78 s > • In the first argument of ‘fileExtension’, namely ‘file’
  409. 8.78 s > In the first argument of ‘(==)’, namely ‘fileExtension file’
  410. 8.78 s > In the first argument of ‘when’, namely
  411. 8.78 s > ‘(fileExtension file == Just ".html")’
  412. 8.78 s > |
  413. 8.78 s > 34 | when (fileExtension file == Just ".html") $ do
  414. 8.78 s > | ^^^^
  415. 8.78 s >
  416. 8.78 s > test/SchemaDotOrg/JSONLD/TagsoupSpec.hs:35:30: error: [GHC-83865]
  417. 8.78 s > • Couldn't match type: [Char]
  418. 8.78 s > with: Path.Internal.Posix.Path Path.Posix.Rel Path.Posix.File
  419. 8.78 s > Expected: Path.Internal.Posix.Path Path.Posix.Rel Path.Posix.File
  420. 8.78 s > Actual: FilePath
  421. 8.78 s > • In the first argument of ‘fromRelFile’, namely ‘file’
  422. 8.78 s > In the expression: fromRelFile file
  423. 8.78 s > In an equation for ‘fp’: fp = fromRelFile file
  424. 8.78 s > |
  425. 8.78 s > 35 | let fp = fromRelFile file
  426. 8.78 s > | ^^^^
  427. 8.78 s >
  428. 8.78 s For full logs, run:
  429. 8.78 s nix log /nix/store/b7wxkz1av6hmgals5h16625kcxfjpvyg-schema-dot-org-jsonld-0.0.0.0.drv
  430. 9.65 s Build failed.