build checks.x86_64-linux.jsonld

Queued Started Finished

Reproduce this run
Retry Run
  1. 0.00 s $ /nix/store/9ypz3flqsrl5xl495mm8h645gadjsxi1-coreutils-9.11/bin/timeout --kill-after=15s 7200s /nix/store/23zk8sgzamrbmj1fday15szf7f2279s8-nix-2.34.7/bin/nix --extra-experimental-features nix-command --extra-experimental-features flakes --log-format internal-json build --no-link --print-out-paths git+https://github.com/NorfairKing/schema-dot-org?ref=master&rev=3a1492b22d4bb71e528c42ea81cc32f33e9d359c&shallow=1#checks.x86_64-linux.jsonld --print-build-logs
  2. 0.08 s fetching Git repository 'https://github.com/NorfairKing/schema-dot-org'
  3. 0.68 s remote: Enumerating objects: 94, done.
  4. 0.69 s remote: Counting objects: 1% (1/94) remote: Counting objects: 2% (2/94) remote: Counting objects: 3% (3/94) remote: Counting objects: 4% (4/94) remote: Counting objects: 5% (5/94) remote: Counting objects: 6% (6/94) remote: Counting objects: 7% (7/94) remote: Counting objects: 8% (8/94) remote: Counting objects: 9% (9/94) remote: Counting objects: 10% (10/94) remote: Counting objects: 11% (11/94) remote: Counting objects: 12% (12/94) remote: Counting objects: 13% (13/94) remote: Counting objects: 14% (14/94) remote: Counting objects: 15% (15/94) remote: Counting objects: 17% (16/94) remote: Counting objects: 18% (17/94) remote: Counting objects: 19% (18/94) remote: Counting objects: 20% (19/94) remote: Counting objects: 21% (20/94) remote: Counting objects: 22% (21/94) remote: Counting objects: 23% (22/94) remote: Counting objects: 24% (23/94) remote: Counting objects: 25% (24/94) remote: Counting objects: 26% (25/94) remote: Counting objects: 27% (26/94) remote: Counting objects: 28% (27/94) remote: Counting objects: 29% (28/94) remote: Counting objects: 30% (29/94) remote: Counting objects: 31% (30/94) remote: Counting objects: 32% (31/94) remote: Counting objects: 34% (32/94) remote: Counting objects: 35% (33/94) remote: Counting objects: 36% (34/94) remote: Counting objects: 37% (35/94) remote: Counting objects: 38% (36/94) remote: Counting objects: 39% (37/94) remote: Counting objects: 40% (38/94) remote: Counting objects: 41% (39/94) remote: Counting objects: 42% (40/94) remote: Counting objects: 43% (41/94) remote: Counting objects: 44% (42/94) remote: Counting objects: 45% (43/94) remote: Counting objects: 46% (44/94) remote: Counting objects: 47% (45/94) remote: Counting objects: 48% (46/94) remote: Counting objects: 50% (47/94) remote: Counting objects: 51% (48/94) remote: Counting objects: 52% (49/94) remote: Counting objects: 53% (50/94) remote: Counting objects: 54% (51/94) remote: Counting objects: 55% (52/94) remote: Counting objects: 56% (53/94) remote: Counting objects: 57% (54/94) remote: Counting objects: 58% (55/94) remote: Counting objects: 59% (56/94) remote: Counting objects: 60% (57/94) remote: Counting objects: 61% (58/94) remote: Counting objects: 62% (59/94) remote: Counting objects: 63% (60/94) remote: Counting objects: 64% (61/94) remote: Counting objects: 65% (62/94) remote: Counting objects: 67% (63/94) remote: Counting objects: 68% (64/94) remote: Counting objects: 69% (65/94) remote: Counting objects: 70% (66/94) remote: Counting objects: 71% (67/94) remote: Counting objects: 72% (68/94) remote: Counting objects: 73% (69/94) remote: Counting objects: 74% (70/94) remote: Counting objects: 75% (71/94) remote: Counting objects: 76% (72/94) remote: Counting objects: 77% (73/94) remote: Counting objects: 78% (74/94) remote: Counting objects: 79% (75/94) remote: Counting objects: 80% (76/94) remote: Counting objects: 81% (77/94) remote: Counting objects: 82% (78/94) remote: Counting objects: 84% (79/94) remote: Counting objects: 85% (80/94) remote: Counting objects: 86% (81/94) remote: Counting objects: 87% (82/94) remote: Counting objects: 88% (83/94) remote: Counting objects: 89% (84/94) remote: Counting objects: 90% (85/94) remote: Counting objects: 91% (86/94) remote: Counting objects: 92% (87/94) remote: Counting objects: 93% (88/94) remote: Counting objects: 94% (89/94) remote: Counting objects: 95% (90/94) remote: Counting objects: 96% (91/94) remote: Counting objects: 97% (92/94) remote: Counting objects: 98% (93/94) remote: Counting objects: 100% (94/94) remote: Counting objects: 100% (94/94), done.
  5. 0.69 s remote: Compressing objects: 1% (1/78) remote: Compressing objects: 2% (2/78) remote: Compressing objects: 3% (3/78) remote: Compressing objects: 5% (4/78) remote: Compressing objects: 6% (5/78) remote: Compressing objects: 7% (6/78) remote: Compressing objects: 8% (7/78) remote: Compressing objects: 10% (8/78) remote: Compressing objects: 11% (9/78) remote: Compressing objects: 12% (10/78) remote: Compressing objects: 14% (11/78) remote: Compressing objects: 15% (12/78) remote: Compressing objects: 16% (13/78) remote: Compressing objects: 17% (14/78) remote: Compressing objects: 19% (15/78) remote: Compressing objects: 20% (16/78) remote: Compressing objects: 21% (17/78) remote: Compressing objects: 23% (18/78) remote: Compressing objects: 24% (19/78) remote: Compressing objects: 25% (20/78) remote: Compressing objects: 26% (21/78) remote: Compressing objects: 28% (22/78) remote: Compressing objects: 29% (23/78) remote: Compressing objects: 30% (24/78) remote: Compressing objects: 32% (25/78) remote: Compressing objects: 33% (26/78) remote: Compressing objects: 34% (27/78) remote: Compressing objects: 35% (28/78) remote: Compressing objects: 37% (29/78) remote: Compressing objects: 38% (30/78) remote: Compressing objects: 39% (31/78) remote: Compressing objects: 41% (32/78) remote: Compressing objects: 42% (33/78) remote: Compressing objects: 43% (34/78) remote: Compressing objects: 44% (35/78) remote: Compressing objects: 46% (36/78) remote: Compressing objects: 47% (37/78) remote: Compressing objects: 48% (38/78) remote: Compressing objects: 50% (39/78) remote: Compressing objects: 51% (40/78) remote: Compressing objects: 52% (41/78) remote: Compressing objects: 53% (42/78) remote: Compressing objects: 55% (43/78) remote: Compressing objects: 56% (44/78) remote: Compressing objects: 57% (45/78) remote: Compressing objects: 58% (46/78) remote: Compressing objects: 60% (47/78) remote: Compressing objects: 61% (48/78) remote: Compressing objects: 62% (49/78) remote: Compressing objects: 64% (50/78) remote: Compressing objects: 65% (51/78) remote: Compressing objects: 66% (52/78) remote: Compressing objects: 67% (53/78) remote: Compressing objects: 69% (54/78) remote: Compressing objects: 70% (55/78) remote: Compressing objects: 71% (56/78) remote: Compressing objects: 73% (57/78) remote: Compressing objects: 74% (58/78) remote: Compressing objects: 75% (59/78) remote: Compressing objects: 76% (60/78) remote: Compressing objects: 78% (61/78) remote: Compressing objects: 79% (62/78) remote: Compressing objects: 80% (63/78) remote: Compressing objects: 82% (64/78) remote: Compressing objects: 83% (65/78) remote: Compressing objects: 84% (66/78) remote: Compressing objects: 85% (67/78) remote: Compressing objects: 87% (68/78) remote: Compressing objects: 88% (69/78) remote: Compressing objects: 89% (70/78) remote: Compressing objects: 91% (71/78) remote: Compressing objects: 92% (72/78) remote: Compressing objects: 93% (73/78) remote: Compressing objects: 94% (74/78) remote: Compressing objects: 96% (75/78) remote: Compressing objects: 97% (76/78) remote: Compressing objects: 98% (77/78) remote: Compressing objects: 100% (78/78) remote: Compressing objects: 100% (78/78), done.
  6. 0.71 s Unpacking objects: 1% (1/94) Unpacking objects: 2% (2/94) Unpacking objects: 3% (3/94) Unpacking objects: 4% (4/94) Unpacking objects: 5% (5/94) Unpacking objects: 6% (6/94) Unpacking objects: 7% (7/94) Unpacking objects: 8% (8/94) Unpacking objects: 9% (9/94) Unpacking objects: 10% (10/94) Unpacking objects: 11% (11/94) Unpacking objects: 12% (12/94) Unpacking objects: 13% (13/94) Unpacking objects: 14% (14/94) Unpacking objects: 15% (15/94) Unpacking objects: 17% (16/94) Unpacking objects: 18% (17/94) Unpacking objects: 19% (18/94) Unpacking objects: 20% (19/94) Unpacking objects: 21% (20/94) Unpacking objects: 22% (21/94) Unpacking objects: 23% (22/94) Unpacking objects: 24% (23/94) Unpacking objects: 25% (24/94) Unpacking objects: 26% (25/94) Unpacking objects: 27% (26/94) Unpacking objects: 28% (27/94) Unpacking objects: 29% (28/94) Unpacking objects: 30% (29/94) Unpacking objects: 31% (30/94) Unpacking objects: 32% (31/94) Unpacking objects: 34% (32/94) Unpacking objects: 35% (33/94) Unpacking objects: 36% (34/94) Unpacking objects: 37% (35/94) Unpacking objects: 38% (36/94) Unpacking objects: 39% (37/94) Unpacking objects: 40% (38/94) Unpacking objects: 41% (39/94) Unpacking objects: 42% (40/94) Unpacking objects: 43% (41/94) Unpacking objects: 44% (42/94) Unpacking objects: 45% (43/94) Unpacking objects: 46% (44/94) Unpacking objects: 47% (45/94) Unpacking objects: 48% (46/94) Unpacking objects: 50% (47/94) Unpacking objects: 51% (48/94) Unpacking objects: 52% (49/94) Unpacking objects: 53% (50/94) Unpacking objects: 54% (51/94) Unpacking objects: 55% (52/94) Unpacking objects: 56% (53/94) Unpacking objects: 57% (54/94) Unpacking objects: 58% (55/94) Unpacking objects: 59% (56/94) Unpacking objects: 60% (57/94) Unpacking objects: 61% (58/94) Unpacking objects: 62% (59/94) Unpacking objects: 63% (60/94) Unpacking objects: 64% (61/94) Unpacking objects: 65% (62/94) Unpacking objects: 67% (63/94) Unpacking objects: 68% (64/94) Unpacking objects: 69% (65/94) Unpacking objects: 70% (66/94) Unpacking objects: 71% (67/94) Unpacking objects: 72% (68/94) Unpacking objects: 73% (69/94) Unpacking objects: 74% (70/94) Unpacking objects: 75% (71/94) Unpacking objects: 76% (72/94) Unpacking objects: 77% (73/94) Unpacking objects: 78% (74/94) Unpacking objects: 79% (75/94) Unpacking objects: 80% (76/94) Unpacking objects: 81% (77/94) Unpacking objects: 82% (78/94) Unpacking objects: 84% (79/94) Unpacking objects: 85% (80/94) Unpacking objects: 86% (81/94) Unpacking objects: 87% (82/94) Unpacking objects: 88% (83/94) Unpacking objects: 89% (84/94) Unpacking objects: 90% (85/94) Unpacking objects: 91% (86/94) Unpacking objects: 92% (87/94) Unpacking objects: 93% (88/94) Unpacking objects: 94% (89/94) Unpacking objects: 95% (90/94) remote: Total 94 (delta 4), reused 59 (delta 1), pack-reused 0 (from 0)
  7. 0.72 s Unpacking objects: 96% (91/94) Unpacking objects: 97% (92/94) Unpacking objects: 98% (93/94) Unpacking objects: 100% (94/94) Unpacking objects: 100% (94/94), 116.36 KiB | 4.65 MiB/s, done.
  8. 0.72 s From https://github.com/NorfairKing/schema-dot-org
  9. 0.72 s * branch 3a1492b22d4bb71e528c42ea81cc32f33e9d359c -> FETCH_HEAD
  10. 1.81 s
  11. 1.98 s Building /nix/store/b7wxkz1av6hmgals5h16625kcxfjpvyg-schema-dot-org-jsonld-0.0.0.0.drv
  12. 2.29 s [schema-dot-org-jsonld] Phase: setupCompilerEnvironmentPhase
  13. 2.29 s [schema-dot-org-jsonld] Build with /nix/store/k493jzz83044mqayvlb6247l35780kxy-ghc-9.10.3.
  14. 3.01 s [schema-dot-org-jsonld] Phase: unpackPhase
  15. 3.01 s [schema-dot-org-jsonld] unpacking source archive /nix/store/9q5dm03axrmxqhm6x7iqpyv5947n8j8l-schema-dot-org-jsonld-source-0.0.0.0/schema-dot-org-jsonld-0.0.0.0.tar.gz
  16. 3.02 s [schema-dot-org-jsonld] source root is schema-dot-org-jsonld-0.0.0.0
  17. 3.03 s [schema-dot-org-jsonld] setting SOURCE_DATE_EPOCH to timestamp 1788936908 of file "schema-dot-org-jsonld-0.0.0.0/test/Spec.hs"
  18. 3.05 s [schema-dot-org-jsonld] Phase: patchPhase
  19. 3.06 s [schema-dot-org-jsonld] Phase: compileBuildDriverPhase
  20. 3.06 s [schema-dot-org-jsonld] setupCompileFlags: -package-db=/build/tmp.BbU3oGjwhp/setup-package.conf.d -threaded
  21. 3.11 s [schema-dot-org-jsonld] [1 of 2] Compiling Main ( Setup.hs, /build/tmp.BbU3oGjwhp/Main.o )
  22. 3.17 s [schema-dot-org-jsonld] [2 of 2] Linking Setup
  23. 4.41 s [schema-dot-org-jsonld] Phase: updateAutotoolsGnuConfigScriptsPhase
  24. 4.43 s [schema-dot-org-jsonld] Phase: configurePhase
  25. 4.43 s [schema-dot-org-jsonld] configureFlags: --verbose --prefix=/nix/store/8q2s09jza1l7wqhq4i0sqrkqmsx0ldiz-schema-dot-org-jsonld-0.0.0.0 --libdir=$prefix/lib/$compiler/lib --libsubdir=$abi/$libname --docdir=/nix/store/nicsxijpgvgpw191gz23d9r192p566w0-schema-dot-org-jsonld-0.0.0.0-doc/share/doc/schema-dot-org-jsonld-0.0.0.0 --with-gcc=gcc --package-db=/build/tmp.BbU3oGjwhp/package.conf.d --ghc-option=-j14 --ghc-option=+RTS --ghc-option=-A64M --ghc-option=-RTS --enable-library-profiling --profiling-detail=exported-functions --disable-profiling --enable-shared --disable-coverage --enable-static --disable-executable-dynamic --enable-tests --disable-benchmarks --enable-library-vanilla --disable-library-for-ghci --enable-split-sections --enable-library-stripping --enable-executable-stripping --ghc-option=-haddock --ghc-option=-Wall --ghc-option=-Werror --extra-lib-dirs=/nix/store/wl2nw5l4x4dg6kclbgpq7v9212i1s6cy-ncurses-6.6/lib --extra-lib-dirs=/nix/store/2zs4bbi72plfm8j6zxf1js4f3yc4yzwy-libffi-3.5.2/lib --extra-lib-dirs=/nix/store/qhmqdg27kcrlkl8ida6d5hiacw0y8d21-elfutils-0.194/lib --extra-lib-dirs=/nix/store/y56aqb1m3y5davn6hsv4jfbml78qw4mv-gmp-with-cxx-6.3.0/lib --extra-lib-dirs=/nix/store/wjfhh11sfcdf97mvg7hbxickybxzk850-numactl-2.0.18/lib
  26. 4.44 s [schema-dot-org-jsonld] Using Parsec parser
  27. 4.44 s [schema-dot-org-jsonld] Configuring schema-dot-org-jsonld-0.0.0.0...
  28. 5.18 s [schema-dot-org-jsonld] Dependency aeson: using aeson-2.2.4.1
  29. 5.18 s [schema-dot-org-jsonld] Dependency base >=4.7 && <5: using base-4.20.2.0
  30. 5.18 s [schema-dot-org-jsonld] Dependency bytestring: using bytestring-0.12.2.0
  31. 5.18 s [schema-dot-org-jsonld] Dependency schema-dot-org: using schema-dot-org-0.0.0.0
  32. 5.18 s [schema-dot-org-jsonld] Dependency tagsoup: using tagsoup-0.14.8
  33. 5.18 s [schema-dot-org-jsonld] Dependency text: using text-2.1.3
  34. 5.18 s [schema-dot-org-jsonld] Dependency vector: using vector-0.13.2.0
  35. 5.18 s [schema-dot-org-jsonld] Dependency aeson: using aeson-2.2.4.1
  36. 5.18 s [schema-dot-org-jsonld] Dependency base >=4.7 && <5: using base-4.20.2.0
  37. 5.18 s [schema-dot-org-jsonld] Dependency bytestring: using bytestring-0.12.2.0
  38. 5.18 s [schema-dot-org-jsonld] Dependency path: using path-0.9.6
  39. 5.18 s [schema-dot-org-jsonld] Dependency schema-dot-org-jsonld: using schema-dot-org-jsonld-0.0.0.0
  40. 5.18 s [schema-dot-org-jsonld] Dependency sydtest: using sydtest-0.20.0.1
  41. 5.18 s [schema-dot-org-jsonld] Dependency sydtest-aeson: using sydtest-aeson-0.2.0.1
  42. 5.18 s [schema-dot-org-jsonld] Source component graph:
  43. 5.18 s [schema-dot-org-jsonld] component lib
  44. 5.18 s [schema-dot-org-jsonld] component test:schema-dot-org-jsonld-test dependency lib
  45. 5.18 s [schema-dot-org-jsonld] Configured component graph:
  46. 5.18 s [schema-dot-org-jsonld] component schema-dot-org-jsonld-0.0.0.0-IFXBqy7zHoeF7tncdo1uxB
  47. 5.18 s [schema-dot-org-jsonld] include aeson-2.2.4.1-I5kgiCyiPJO8jEV0bEgUez
  48. 5.18 s [schema-dot-org-jsonld] include base-4.20.2.0-4d66
  49. 5.18 s [schema-dot-org-jsonld] include bytestring-0.12.2.0-25ef
  50. 5.18 s [schema-dot-org-jsonld] include schema-dot-org-0.0.0.0-DK3bNdhkDmvFOAaebGqsq5
  51. 5.18 s [schema-dot-org-jsonld] include tagsoup-0.14.8-BsqbPSEZh9W5mB1CzgSWho
  52. 5.18 s [schema-dot-org-jsonld] include text-2.1.3-3f03
  53. 5.18 s [schema-dot-org-jsonld] include vector-0.13.2.0-4sNODSde54Y5T3xVFmV0fE
  54. 5.18 s [schema-dot-org-jsonld] component schema-dot-org-jsonld-0.0.0.0-Cu5ewoR91fM6pMI6cAFpDW-schema-dot-org-jsonld-test
  55. 5.18 s [schema-dot-org-jsonld] include aeson-2.2.4.1-I5kgiCyiPJO8jEV0bEgUez
  56. 5.18 s [schema-dot-org-jsonld] include base-4.20.2.0-4d66
  57. 5.18 s [schema-dot-org-jsonld] include bytestring-0.12.2.0-25ef
  58. 5.18 s [schema-dot-org-jsonld] include path-0.9.6-L3t3TcndY3P7bshtU9371n
  59. 5.18 s [schema-dot-org-jsonld] include schema-dot-org-jsonld-0.0.0.0-IFXBqy7zHoeF7tncdo1uxB
  60. 5.18 s [schema-dot-org-jsonld] include sydtest-0.20.0.1-Jo2KtBwwg0M2hH86LVxxcs
  61. 5.18 s [schema-dot-org-jsonld] include sydtest-aeson-0.2.0.1-AEtebtKhgEIKIZK2rvdpfT
  62. 5.18 s [schema-dot-org-jsonld] Linked component graph:
  63. 5.18 s [schema-dot-org-jsonld] unit schema-dot-org-jsonld-0.0.0.0-IFXBqy7zHoeF7tncdo1uxB
  64. 5.18 s [schema-dot-org-jsonld] include aeson-2.2.4.1-I5kgiCyiPJO8jEV0bEgUez
  65. 5.18 s [schema-dot-org-jsonld] include base-4.20.2.0-4d66
  66. 5.18 s [schema-dot-org-jsonld] include bytestring-0.12.2.0-25ef
  67. 5.18 s [schema-dot-org-jsonld] include schema-dot-org-0.0.0.0-DK3bNdhkDmvFOAaebGqsq5
  68. 5.18 s [schema-dot-org-jsonld] include tagsoup-0.14.8-BsqbPSEZh9W5mB1CzgSWho
  69. 5.18 s [schema-dot-org-jsonld] include text-2.1.3-3f03
  70. 5.18 s [schema-dot-org-jsonld] include vector-0.13.2.0-4sNODSde54Y5T3xVFmV0fE
  71. 5.18 s [schema-dot-org-jsonld] SchemaDotOrg.JSONLD=schema-dot-org-jsonld-0.0.0.0-IFXBqy7zHoeF7tncdo1uxB:SchemaDotOrg.JSONLD,SchemaDotOrg.JSONLD.Parse=schema-dot-org-jsonld-0.0.0.0-IFXBqy7zHoeF7tncdo1uxB:SchemaDotOrg.JSONLD.Parse,SchemaDotOrg.JSONLD.Render=schema-dot-org-jsonld-0.0.0.0-IFXBqy7zHoeF7tncdo1uxB:SchemaDotOrg.JSONLD.Render,SchemaDotOrg.JSONLD.Tagsoup=schema-dot-org-jsonld-0.0.0.0-IFXBqy7zHoeF7tncdo1uxB:SchemaDotOrg.JSONLD.Tagsoup
  72. 5.18 s [schema-dot-org-jsonld] unit schema-dot-org-jsonld-0.0.0.0-Cu5ewoR91fM6pMI6cAFpDW-schema-dot-org-jsonld-test
  73. 5.18 s [schema-dot-org-jsonld] include aeson-2.2.4.1-I5kgiCyiPJO8jEV0bEgUez
  74. 5.18 s [schema-dot-org-jsonld] include base-4.20.2.0-4d66
  75. 5.18 s [schema-dot-org-jsonld] include bytestring-0.12.2.0-25ef
  76. 5.18 s [schema-dot-org-jsonld] include path-0.9.6-L3t3TcndY3P7bshtU9371n
  77. 5.18 s [schema-dot-org-jsonld] include schema-dot-org-jsonld-0.0.0.0-IFXBqy7zHoeF7tncdo1uxB
  78. 5.18 s [schema-dot-org-jsonld] include sydtest-0.20.0.1-Jo2KtBwwg0M2hH86LVxxcs
  79. 5.18 s [schema-dot-org-jsonld] include sydtest-aeson-0.2.0.1-AEtebtKhgEIKIZK2rvdpfT
  80. 5.18 s [schema-dot-org-jsonld] Ready component graph:
  81. 5.18 s [schema-dot-org-jsonld] definite schema-dot-org-jsonld-0.0.0.0-IFXBqy7zHoeF7tncdo1uxB
  82. 5.18 s [schema-dot-org-jsonld] depends aeson-2.2.4.1-I5kgiCyiPJO8jEV0bEgUez
  83. 5.18 s [schema-dot-org-jsonld] depends base-4.20.2.0-4d66
  84. 5.18 s [schema-dot-org-jsonld] depends bytestring-0.12.2.0-25ef
  85. 5.18 s [schema-dot-org-jsonld] depends schema-dot-org-0.0.0.0-DK3bNdhkDmvFOAaebGqsq5
  86. 5.18 s [schema-dot-org-jsonld] depends tagsoup-0.14.8-BsqbPSEZh9W5mB1CzgSWho
  87. 5.18 s [schema-dot-org-jsonld] depends text-2.1.3-3f03
  88. 5.18 s [schema-dot-org-jsonld] depends vector-0.13.2.0-4sNODSde54Y5T3xVFmV0fE
  89. 5.18 s [schema-dot-org-jsonld] definite schema-dot-org-jsonld-0.0.0.0-Cu5ewoR91fM6pMI6cAFpDW-schema-dot-org-jsonld-test
  90. 5.18 s [schema-dot-org-jsonld] depends aeson-2.2.4.1-I5kgiCyiPJO8jEV0bEgUez
  91. 5.18 s [schema-dot-org-jsonld] depends base-4.20.2.0-4d66
  92. 5.18 s [schema-dot-org-jsonld] depends bytestring-0.12.2.0-25ef
  93. 5.18 s [schema-dot-org-jsonld] depends path-0.9.6-L3t3TcndY3P7bshtU9371n
  94. 5.18 s [schema-dot-org-jsonld] depends schema-dot-org-jsonld-0.0.0.0-IFXBqy7zHoeF7tncdo1uxB
  95. 5.18 s [schema-dot-org-jsonld] depends sydtest-0.20.0.1-Jo2KtBwwg0M2hH86LVxxcs
  96. 5.18 s [schema-dot-org-jsonld] depends sydtest-aeson-0.2.0.1-AEtebtKhgEIKIZK2rvdpfT
  97. 5.18 s [schema-dot-org-jsonld] Using Cabal-3.12.1.0 compiled by ghc-9.10
  98. 5.18 s [schema-dot-org-jsonld] Using compiler: ghc-9.10.3
  99. 5.18 s [schema-dot-org-jsonld] Using install prefix:
  100. 5.18 s [schema-dot-org-jsonld] /nix/store/8q2s09jza1l7wqhq4i0sqrkqmsx0ldiz-schema-dot-org-jsonld-0.0.0.0
  101. 5.18 s [schema-dot-org-jsonld] Executables installed in:
  102. 5.18 s [schema-dot-org-jsonld] /nix/store/8q2s09jza1l7wqhq4i0sqrkqmsx0ldiz-schema-dot-org-jsonld-0.0.0.0/bin
  103. 5.18 s [schema-dot-org-jsonld] Libraries installed in:
  104. 5.18 s [schema-dot-org-jsonld] /nix/store/8q2s09jza1l7wqhq4i0sqrkqmsx0ldiz-schema-dot-org-jsonld-0.0.0.0/lib/ghc-9.10.3/lib/x86_64-linux-ghc-9.10.3-21af/schema-dot-org-jsonld-0.0.0.0-IFXBqy7zHoeF7tncdo1uxB
  105. 5.18 s [schema-dot-org-jsonld] Dynamic Libraries installed in:
  106. 5.18 s [schema-dot-org-jsonld] /nix/store/8q2s09jza1l7wqhq4i0sqrkqmsx0ldiz-schema-dot-org-jsonld-0.0.0.0/lib/ghc-9.10.3/lib/x86_64-linux-ghc-9.10.3-21af
  107. 5.18 s [schema-dot-org-jsonld] Private executables installed in:
  108. 5.18 s [schema-dot-org-jsonld] /nix/store/8q2s09jza1l7wqhq4i0sqrkqmsx0ldiz-schema-dot-org-jsonld-0.0.0.0/libexec/x86_64-linux-ghc-9.10.3-21af/schema-dot-org-jsonld-0.0.0.0
  109. 5.18 s [schema-dot-org-jsonld] Data files installed in:
  110. 5.18 s [schema-dot-org-jsonld] /nix/store/8q2s09jza1l7wqhq4i0sqrkqmsx0ldiz-schema-dot-org-jsonld-0.0.0.0/share/x86_64-linux-ghc-9.10.3-21af/schema-dot-org-jsonld-0.0.0.0
  111. 5.18 s [schema-dot-org-jsonld] Documentation installed in:
  112. 5.18 s [schema-dot-org-jsonld] /nix/store/nicsxijpgvgpw191gz23d9r192p566w0-schema-dot-org-jsonld-0.0.0.0-doc/share/doc/schema-dot-org-jsonld-0.0.0.0
  113. 5.18 s [schema-dot-org-jsonld] Configuration files installed in:
  114. 5.18 s [schema-dot-org-jsonld] /nix/store/8q2s09jza1l7wqhq4i0sqrkqmsx0ldiz-schema-dot-org-jsonld-0.0.0.0/etc
  115. 5.18 s [schema-dot-org-jsonld] No alex found
  116. 5.18 s [schema-dot-org-jsonld] Using ar found on system at:
  117. 5.18 s [schema-dot-org-jsonld] /nix/store/mbyy19mdwnfvfwmdi0gqgggx0njvpl1w-binutils-wrapper-2.46/bin/ar
  118. 5.18 s [schema-dot-org-jsonld] No c2hs found
  119. 5.18 s [schema-dot-org-jsonld] No cpphs found
  120. 5.18 s [schema-dot-org-jsonld] No doctest found
  121. 5.18 s [schema-dot-org-jsonld] Using gcc version 15.2.0 given by user at:
  122. 5.18 s [schema-dot-org-jsonld] /nix/store/788mx070y81zjlg5ipcl0cra3afviw9k-gcc-wrapper-15.2.0/bin/gcc
  123. 5.18 s [schema-dot-org-jsonld] Using ghc version 9.10.3 found on system at:
  124. 5.18 s [schema-dot-org-jsonld] /nix/store/k493jzz83044mqayvlb6247l35780kxy-ghc-9.10.3/bin/ghc
  125. 5.18 s [schema-dot-org-jsonld] Using ghc-pkg version 9.10.3 found on system at:
  126. 5.18 s [schema-dot-org-jsonld] /nix/store/k493jzz83044mqayvlb6247l35780kxy-ghc-9.10.3/bin/ghc-pkg-9.10.3
  127. 5.18 s [schema-dot-org-jsonld] No ghcjs found
  128. 5.18 s [schema-dot-org-jsonld] No ghcjs-pkg found
  129. 5.18 s [schema-dot-org-jsonld] No greencard found
  130. 5.18 s [schema-dot-org-jsonld] Using haddock version 2.31.1 found on system at:
  131. 5.18 s [schema-dot-org-jsonld] /nix/store/k493jzz83044mqayvlb6247l35780kxy-ghc-9.10.3/bin/haddock-ghc-9.10.3
  132. 5.18 s [schema-dot-org-jsonld] No happy found
  133. 5.18 s [schema-dot-org-jsonld] Using haskell-suite found on system at: haskell-suite-dummy-location
  134. 5.18 s [schema-dot-org-jsonld] Using haskell-suite-pkg found on system at: haskell-suite-pkg-dummy-location
  135. 5.18 s [schema-dot-org-jsonld] No hmake found
  136. 5.18 s [schema-dot-org-jsonld] Using hpc version 0.69 found on system at:
  137. 5.18 s [schema-dot-org-jsonld] /nix/store/k493jzz83044mqayvlb6247l35780kxy-ghc-9.10.3/bin/hpc-ghc-9.10.3
  138. 5.18 s [schema-dot-org-jsonld] Using hsc2hs version 0.68.10 found on system at:
  139. 5.18 s [schema-dot-org-jsonld] /nix/store/k493jzz83044mqayvlb6247l35780kxy-ghc-9.10.3/bin/hsc2hs-ghc-9.10.3
  140. 5.18 s [schema-dot-org-jsonld] Using hscolour version 1.25 found on system at:
  141. 5.18 s [schema-dot-org-jsonld] /nix/store/hvlf3xzdw0p5s3kybdkch6iqyz0740rc-hscolour-1.25/bin/HsColour
  142. 5.18 s [schema-dot-org-jsonld] No jhc found
  143. 5.18 s [schema-dot-org-jsonld] Using ld found on system at:
  144. 5.18 s [schema-dot-org-jsonld] /nix/store/788mx070y81zjlg5ipcl0cra3afviw9k-gcc-wrapper-15.2.0/bin/ld
  145. 5.18 s [schema-dot-org-jsonld] No pkg-config found
  146. 5.18 s [schema-dot-org-jsonld] Using runghc version 9.10.3 found on system at:
  147. 5.18 s [schema-dot-org-jsonld] /nix/store/k493jzz83044mqayvlb6247l35780kxy-ghc-9.10.3/bin/runghc-9.10.3
  148. 5.18 s [schema-dot-org-jsonld] Using strip version 2.46 found on system at:
  149. 5.18 s [schema-dot-org-jsonld] /nix/store/788mx070y81zjlg5ipcl0cra3afviw9k-gcc-wrapper-15.2.0/bin/strip
  150. 5.18 s [schema-dot-org-jsonld] Using tar found on system at:
  151. 5.18 s [schema-dot-org-jsonld] /nix/store/k5akwnrn9x2afaj2va7g4a2zpdim8l43-gnutar-1.35/bin/tar
  152. 5.18 s [schema-dot-org-jsonld] No uhc found
  153. 5.93 s [schema-dot-org-jsonld] Phase: buildPhase
  154. 6.01 s [schema-dot-org-jsonld] Preprocessing library for schema-dot-org-jsonld-0.0.0.0...
  155. 6.01 s [schema-dot-org-jsonld] Building library for schema-dot-org-jsonld-0.0.0.0...
  156. 6.10 s [schema-dot-org-jsonld] [1 of 5] Compiling Paths_schema_dot_org_jsonld ( dist/build/autogen/Paths_schema_dot_org_jsonld.hs, dist/build/Paths_schema_dot_org_jsonld.o, dist/build/Paths_schema_dot_org_jsonld.dyn_o )
  157. 6.24 s [schema-dot-org-jsonld] [2 of 5] Compiling SchemaDotOrg.JSONLD.Parse ( src/SchemaDotOrg/JSONLD/Parse.hs, dist/build/SchemaDotOrg/JSONLD/Parse.o, dist/build/SchemaDotOrg/JSONLD/Parse.dyn_o )
  158. 6.74 s [schema-dot-org-jsonld] [3 of 5] Compiling SchemaDotOrg.JSONLD.Render ( src/SchemaDotOrg/JSONLD/Render.hs, dist/build/SchemaDotOrg/JSONLD/Render.o, dist/build/SchemaDotOrg/JSONLD/Render.dyn_o )
  159. 6.74 s [schema-dot-org-jsonld] [4 of 5] Compiling SchemaDotOrg.JSONLD.Tagsoup ( src/SchemaDotOrg/JSONLD/Tagsoup.hs, dist/build/SchemaDotOrg/JSONLD/Tagsoup.o, dist/build/SchemaDotOrg/JSONLD/Tagsoup.dyn_o )
  160. 6.85 s [schema-dot-org-jsonld] [5 of 5] Compiling SchemaDotOrg.JSONLD ( src/SchemaDotOrg/JSONLD.hs, dist/build/SchemaDotOrg/JSONLD.o, dist/build/SchemaDotOrg/JSONLD.dyn_o )
  161. 7.08 s [schema-dot-org-jsonld] [1 of 5] Compiling Paths_schema_dot_org_jsonld ( dist/build/autogen/Paths_schema_dot_org_jsonld.hs, dist/build/Paths_schema_dot_org_jsonld.p_o )
  162. 7.36 s [schema-dot-org-jsonld] [2 of 5] Compiling SchemaDotOrg.JSONLD.Parse ( src/SchemaDotOrg/JSONLD/Parse.hs, dist/build/SchemaDotOrg/JSONLD/Parse.p_o )
  163. 7.79 s [schema-dot-org-jsonld] [3 of 5] Compiling SchemaDotOrg.JSONLD.Render ( src/SchemaDotOrg/JSONLD/Render.hs, dist/build/SchemaDotOrg/JSONLD/Render.p_o )
  164. 7.79 s [schema-dot-org-jsonld] [4 of 5] Compiling SchemaDotOrg.JSONLD.Tagsoup ( src/SchemaDotOrg/JSONLD/Tagsoup.hs, dist/build/SchemaDotOrg/JSONLD/Tagsoup.p_o )
  165. 7.88 s [schema-dot-org-jsonld] [5 of 5] Compiling SchemaDotOrg.JSONLD ( src/SchemaDotOrg/JSONLD.hs, dist/build/SchemaDotOrg/JSONLD.p_o )
  166. 9.72 s [schema-dot-org-jsonld] Preprocessing test suite 'schema-dot-org-jsonld-test' for schema-dot-org-jsonld-0.0.0.0...
  167. 9.72 s [schema-dot-org-jsonld] Building test suite 'schema-dot-org-jsonld-test' for schema-dot-org-jsonld-0.0.0.0...
  168. 9.82 s [schema-dot-org-jsonld] [1 of 3] Compiling Paths_schema_dot_org_jsonld ( dist/build/schema-dot-org-jsonld-test/autogen/Paths_schema_dot_org_jsonld.hs, dist/build/schema-dot-org-jsonld-test/schema-dot-org-jsonld-test-tmp/Paths_schema_dot_org_jsonld.o )
  169. 9.91 s [schema-dot-org-jsonld] [2 of 3] Compiling SchemaDotOrg.JSONLD.TagsoupSpec ( test/SchemaDotOrg/JSONLD/TagsoupSpec.hs, dist/build/schema-dot-org-jsonld-test/schema-dot-org-jsonld-test-tmp/SchemaDotOrg/JSONLD/TagsoupSpec.o )
  170. 9.97 s [schema-dot-org-jsonld] test/SchemaDotOrg/JSONLD/TagsoupSpec.hs:33:25: error: [GHC-83865]
  171. 9.97 s [schema-dot-org-jsonld] • Couldn't match type: Path.Internal.Posix.Path
  172. 9.97 s [schema-dot-org-jsonld] Path.Posix.Rel Path.Posix.Dir
  173. 9.97 s [schema-dot-org-jsonld] with: [Char]
  174. 9.97 s [schema-dot-org-jsonld] Expected: FilePath
  175. 9.97 s [schema-dot-org-jsonld] Actual: Path.Internal.Posix.Path Path.Posix.Rel Path.Posix.Dir
  176. 9.97 s [schema-dot-org-jsonld] • In the first argument of ‘scenarioDir’, namely
  177. 9.97 s [schema-dot-org-jsonld] ‘(Path.Internal.Posix.Path "test_resources/" ::
  178. 9.97 s [schema-dot-org-jsonld] Path.Internal.Posix.Path Path.Posix.Rel Path.Posix.Dir)’
  179. 9.97 s [schema-dot-org-jsonld] In the first argument of ‘($)’, namely
  180. 9.98 s [schema-dot-org-jsonld] ‘scenarioDir
  181. 9.98 s [schema-dot-org-jsonld] (Path.Internal.Posix.Path "test_resources/" ::
  182. 9.98 s [schema-dot-org-jsonld] Path.Internal.Posix.Path Path.Posix.Rel Path.Posix.Dir)’
  183. 9.98 s [schema-dot-org-jsonld] In the second argument of ‘($)’, namely
  184. 9.98 s [schema-dot-org-jsonld] ‘scenarioDir
  185. 9.98 s [schema-dot-org-jsonld] (Path.Internal.Posix.Path "test_resources/" ::
  186. 9.98 s [schema-dot-org-jsonld] Path.Internal.Posix.Path Path.Posix.Rel Path.Posix.Dir)
  187. 9.98 s [schema-dot-org-jsonld] $ \ file
  188. 9.98 s [schema-dot-org-jsonld] -> when (fileExtension file == Just ".html")
  189. 9.98 s [schema-dot-org-jsonld] $ do let ...
  190. 9.98 s [schema-dot-org-jsonld] it (unwords [...]) $ do ...’
  191. 9.98 s [schema-dot-org-jsonld] |
  192. 9.98 s [schema-dot-org-jsonld] 33 | scenarioDir [reldir|test_resources|] $ \file ->
  193. 9.98 s [schema-dot-org-jsonld] | ^^^^^^^^^^^^^^^^
  194. 9.98 s [schema-dot-org-jsonld]
  195. 9.98 s [schema-dot-org-jsonld] test/SchemaDotOrg/JSONLD/TagsoupSpec.hs:34:27: error: [GHC-83865]
  196. 9.98 s [schema-dot-org-jsonld] • Couldn't match type: [Char]
  197. 9.98 s [schema-dot-org-jsonld] with: Path.Internal.Posix.Path b0 Path.Posix.File
  198. 9.98 s [schema-dot-org-jsonld] Expected: Path.Internal.Posix.Path b0 Path.Posix.File
  199. 9.98 s [schema-dot-org-jsonld] Actual: FilePath
  200. 9.98 s [schema-dot-org-jsonld] • In the first argument of ‘fileExtension’, namely ‘file’
  201. 9.98 s [schema-dot-org-jsonld] In the first argument of ‘(==)’, namely ‘fileExtension file’
  202. 9.98 s [schema-dot-org-jsonld] In the first argument of ‘when’, namely
  203. 9.98 s [schema-dot-org-jsonld] ‘(fileExtension file == Just ".html")’
  204. 9.98 s [schema-dot-org-jsonld] |
  205. 9.98 s [schema-dot-org-jsonld] 34 | when (fileExtension file == Just ".html") $ do
  206. 9.98 s [schema-dot-org-jsonld] | ^^^^
  207. 9.98 s [schema-dot-org-jsonld]
  208. 9.98 s [schema-dot-org-jsonld] test/SchemaDotOrg/JSONLD/TagsoupSpec.hs:35:30: error: [GHC-83865]
  209. 9.98 s [schema-dot-org-jsonld] • Couldn't match type: [Char]
  210. 9.98 s [schema-dot-org-jsonld] with: Path.Internal.Posix.Path Path.Posix.Rel Path.Posix.File
  211. 9.98 s [schema-dot-org-jsonld] Expected: Path.Internal.Posix.Path Path.Posix.Rel Path.Posix.File
  212. 9.98 s [schema-dot-org-jsonld] Actual: FilePath
  213. 9.98 s [schema-dot-org-jsonld] • In the first argument of ‘fromRelFile’, namely ‘file’
  214. 9.98 s [schema-dot-org-jsonld] In the expression: fromRelFile file
  215. 9.98 s [schema-dot-org-jsonld] In an equation for ‘fp’: fp = fromRelFile file
  216. 9.98 s [schema-dot-org-jsonld] |
  217. 9.98 s [schema-dot-org-jsonld] 35 | let fp = fromRelFile file
  218. 9.98 s [schema-dot-org-jsonld] | ^^^^
  219. 9.98 s [schema-dot-org-jsonld]
  220. 10.27 s Progress: 0 of 1 built (1 failed)
  221. 10.27 s Failed to build schema-dot-org-jsonld after 8.2s
  222. 10.28 s Cannot build '/nix/store/b7wxkz1av6hmgals5h16625kcxfjpvyg-schema-dot-org-jsonld-0.0.0.0.drv'.
  223. 10.28 s Reason: builder failed with exit code 1.
  224. 10.28 s Output paths:
  225. 10.28 s /nix/store/8q2s09jza1l7wqhq4i0sqrkqmsx0ldiz-schema-dot-org-jsonld-0.0.0.0
  226. 10.28 s /nix/store/nicsxijpgvgpw191gz23d9r192p566w0-schema-dot-org-jsonld-0.0.0.0-doc
  227. 10.28 s Last 208 log lines:
  228. 10.28 s > Running phase: setupCompilerEnvironmentPhase
  229. 10.28 s > Build with /nix/store/k493jzz83044mqayvlb6247l35780kxy-ghc-9.10.3.
  230. 10.28 s > Running phase: unpackPhase
  231. 10.28 s > unpacking source archive /nix/store/9q5dm03axrmxqhm6x7iqpyv5947n8j8l-schema-dot-org-jsonld-source-0.0.0.0/schema-dot-org-jsonld-0.0.0.0.tar.gz
  232. 10.28 s > source root is schema-dot-org-jsonld-0.0.0.0
  233. 10.28 s > setting SOURCE_DATE_EPOCH to timestamp 1788936908 of file "schema-dot-org-jsonld-0.0.0.0/test/Spec.hs"
  234. 10.28 s > Running phase: patchPhase
  235. 10.28 s > Running phase: compileBuildDriverPhase
  236. 10.28 s > setupCompileFlags: -package-db=/build/tmp.BbU3oGjwhp/setup-package.conf.d -threaded
  237. 10.28 s > [1 of 2] Compiling Main ( Setup.hs, /build/tmp.BbU3oGjwhp/Main.o )
  238. 10.28 s > [2 of 2] Linking Setup
  239. 10.28 s > Running phase: updateAutotoolsGnuConfigScriptsPhase
  240. 10.28 s > Running phase: configurePhase
  241. 10.28 s > configureFlags: --verbose --prefix=/nix/store/8q2s09jza1l7wqhq4i0sqrkqmsx0ldiz-schema-dot-org-jsonld-0.0.0.0 --libdir=$prefix/lib/$compiler/lib --libsubdir=$abi/$libname --docdir=/nix/store/nicsxijpgvgpw191gz23d9r192p566w0-schema-dot-org-jsonld-0.0.0.0-doc/share/doc/schema-dot-org-jsonld-0.0.0.0 --with-gcc=gcc --package-db=/build/tmp.BbU3oGjwhp/package.conf.d --ghc-option=-j14 --ghc-option=+RTS --ghc-option=-A64M --ghc-option=-RTS --enable-library-profiling --profiling-detail=exported-functions --disable-profiling --enable-shared --disable-coverage --enable-static --disable-executable-dynamic --enable-tests --disable-benchmarks --enable-library-vanilla --disable-library-for-ghci --enable-split-sections --enable-library-stripping --enable-executable-stripping --ghc-option=-haddock --ghc-option=-Wall --ghc-option=-Werror --extra-lib-dirs=/nix/store/wl2nw5l4x4dg6kclbgpq7v9212i1s6cy-ncurses-6.6/lib --extra-lib-dirs=/nix/store/2zs4bbi72plfm8j6zxf1js4f3yc4yzwy-libffi-3.5.2/lib --extra-lib-dirs=/nix/store/qhmqdg27kcrlkl8ida6d5hiacw0y8d21-elfutils-0.194/lib --extra-lib-dirs=/nix/store/y56aqb1m3y5davn6hsv4jfbml78qw4mv-gmp-with-cxx-6.3.0/lib --extra-lib-dirs=/nix/store/wjfhh11sfcdf97mvg7hbxickybxzk850-numactl-2.0.18/lib
  242. 10.28 s > Using Parsec parser
  243. 10.28 s > Configuring schema-dot-org-jsonld-0.0.0.0...
  244. 10.28 s > Dependency aeson: using aeson-2.2.4.1
  245. 10.28 s > Dependency base >=4.7 && <5: using base-4.20.2.0
  246. 10.28 s > Dependency bytestring: using bytestring-0.12.2.0
  247. 10.28 s > Dependency schema-dot-org: using schema-dot-org-0.0.0.0
  248. 10.28 s > Dependency tagsoup: using tagsoup-0.14.8
  249. 10.28 s > Dependency text: using text-2.1.3
  250. 10.28 s > Dependency vector: using vector-0.13.2.0
  251. 10.28 s > Dependency aeson: using aeson-2.2.4.1
  252. 10.28 s > Dependency base >=4.7 && <5: using base-4.20.2.0
  253. 10.28 s > Dependency bytestring: using bytestring-0.12.2.0
  254. 10.28 s > Dependency path: using path-0.9.6
  255. 10.28 s > Dependency schema-dot-org-jsonld: using schema-dot-org-jsonld-0.0.0.0
  256. 10.28 s > Dependency sydtest: using sydtest-0.20.0.1
  257. 10.28 s > Dependency sydtest-aeson: using sydtest-aeson-0.2.0.1
  258. 10.28 s > Source component graph:
  259. 10.28 s > component lib
  260. 10.28 s > component test:schema-dot-org-jsonld-test dependency lib
  261. 10.28 s > Configured component graph:
  262. 10.28 s > component schema-dot-org-jsonld-0.0.0.0-IFXBqy7zHoeF7tncdo1uxB
  263. 10.28 s > include aeson-2.2.4.1-I5kgiCyiPJO8jEV0bEgUez
  264. 10.28 s > include base-4.20.2.0-4d66
  265. 10.28 s > include bytestring-0.12.2.0-25ef
  266. 10.28 s > include schema-dot-org-0.0.0.0-DK3bNdhkDmvFOAaebGqsq5
  267. 10.28 s > include tagsoup-0.14.8-BsqbPSEZh9W5mB1CzgSWho
  268. 10.28 s > include text-2.1.3-3f03
  269. 10.28 s > include vector-0.13.2.0-4sNODSde54Y5T3xVFmV0fE
  270. 10.28 s > component schema-dot-org-jsonld-0.0.0.0-Cu5ewoR91fM6pMI6cAFpDW-schema-dot-org-jsonld-test
  271. 10.28 s > include aeson-2.2.4.1-I5kgiCyiPJO8jEV0bEgUez
  272. 10.28 s > include base-4.20.2.0-4d66
  273. 10.28 s > include bytestring-0.12.2.0-25ef
  274. 10.28 s > include path-0.9.6-L3t3TcndY3P7bshtU9371n
  275. 10.28 s > include schema-dot-org-jsonld-0.0.0.0-IFXBqy7zHoeF7tncdo1uxB
  276. 10.28 s > include sydtest-0.20.0.1-Jo2KtBwwg0M2hH86LVxxcs
  277. 10.28 s > include sydtest-aeson-0.2.0.1-AEtebtKhgEIKIZK2rvdpfT
  278. 10.28 s > Linked component graph:
  279. 10.28 s > unit schema-dot-org-jsonld-0.0.0.0-IFXBqy7zHoeF7tncdo1uxB
  280. 10.28 s > include aeson-2.2.4.1-I5kgiCyiPJO8jEV0bEgUez
  281. 10.28 s > include base-4.20.2.0-4d66
  282. 10.28 s > include bytestring-0.12.2.0-25ef
  283. 10.28 s > include schema-dot-org-0.0.0.0-DK3bNdhkDmvFOAaebGqsq5
  284. 10.28 s > include tagsoup-0.14.8-BsqbPSEZh9W5mB1CzgSWho
  285. 10.28 s > include text-2.1.3-3f03
  286. 10.28 s > include vector-0.13.2.0-4sNODSde54Y5T3xVFmV0fE
  287. 10.28 s > SchemaDotOrg.JSONLD=schema-dot-org-jsonld-0.0.0.0-IFXBqy7zHoeF7tncdo1uxB:SchemaDotOrg.JSONLD,SchemaDotOrg.JSONLD.Parse=schema-dot-org-jsonld-0.0.0.0-IFXBqy7zHoeF7tncdo1uxB:SchemaDotOrg.JSONLD.Parse,SchemaDotOrg.JSONLD.Render=schema-dot-org-jsonld-0.0.0.0-IFXBqy7zHoeF7tncdo1uxB:SchemaDotOrg.JSONLD.Render,SchemaDotOrg.JSONLD.Tagsoup=schema-dot-org-jsonld-0.0.0.0-IFXBqy7zHoeF7tncdo1uxB:SchemaDotOrg.JSONLD.Tagsoup
  288. 10.28 s > unit schema-dot-org-jsonld-0.0.0.0-Cu5ewoR91fM6pMI6cAFpDW-schema-dot-org-jsonld-test
  289. 10.28 s > include aeson-2.2.4.1-I5kgiCyiPJO8jEV0bEgUez
  290. 10.28 s > include base-4.20.2.0-4d66
  291. 10.28 s > include bytestring-0.12.2.0-25ef
  292. 10.28 s > include path-0.9.6-L3t3TcndY3P7bshtU9371n
  293. 10.28 s > include schema-dot-org-jsonld-0.0.0.0-IFXBqy7zHoeF7tncdo1uxB
  294. 10.28 s > include sydtest-0.20.0.1-Jo2KtBwwg0M2hH86LVxxcs
  295. 10.28 s > include sydtest-aeson-0.2.0.1-AEtebtKhgEIKIZK2rvdpfT
  296. 10.28 s > Ready component graph:
  297. 10.28 s > definite schema-dot-org-jsonld-0.0.0.0-IFXBqy7zHoeF7tncdo1uxB
  298. 10.28 s > depends aeson-2.2.4.1-I5kgiCyiPJO8jEV0bEgUez
  299. 10.28 s > depends base-4.20.2.0-4d66
  300. 10.28 s > depends bytestring-0.12.2.0-25ef
  301. 10.28 s > depends schema-dot-org-0.0.0.0-DK3bNdhkDmvFOAaebGqsq5
  302. 10.28 s > depends tagsoup-0.14.8-BsqbPSEZh9W5mB1CzgSWho
  303. 10.28 s > depends text-2.1.3-3f03
  304. 10.28 s > depends vector-0.13.2.0-4sNODSde54Y5T3xVFmV0fE
  305. 10.28 s > definite schema-dot-org-jsonld-0.0.0.0-Cu5ewoR91fM6pMI6cAFpDW-schema-dot-org-jsonld-test
  306. 10.28 s > depends aeson-2.2.4.1-I5kgiCyiPJO8jEV0bEgUez
  307. 10.28 s > depends base-4.20.2.0-4d66
  308. 10.28 s > depends bytestring-0.12.2.0-25ef
  309. 10.28 s > depends path-0.9.6-L3t3TcndY3P7bshtU9371n
  310. 10.28 s > depends schema-dot-org-jsonld-0.0.0.0-IFXBqy7zHoeF7tncdo1uxB
  311. 10.28 s > depends sydtest-0.20.0.1-Jo2KtBwwg0M2hH86LVxxcs
  312. 10.28 s > depends sydtest-aeson-0.2.0.1-AEtebtKhgEIKIZK2rvdpfT
  313. 10.28 s > Using Cabal-3.12.1.0 compiled by ghc-9.10
  314. 10.28 s > Using compiler: ghc-9.10.3
  315. 10.28 s > Using install prefix:
  316. 10.28 s > /nix/store/8q2s09jza1l7wqhq4i0sqrkqmsx0ldiz-schema-dot-org-jsonld-0.0.0.0
  317. 10.28 s > Executables installed in:
  318. 10.28 s > /nix/store/8q2s09jza1l7wqhq4i0sqrkqmsx0ldiz-schema-dot-org-jsonld-0.0.0.0/bin
  319. 10.28 s > Libraries installed in:
  320. 10.28 s > /nix/store/8q2s09jza1l7wqhq4i0sqrkqmsx0ldiz-schema-dot-org-jsonld-0.0.0.0/lib/ghc-9.10.3/lib/x86_64-linux-ghc-9.10.3-21af/schema-dot-org-jsonld-0.0.0.0-IFXBqy7zHoeF7tncdo1uxB
  321. 10.28 s > Dynamic Libraries installed in:
  322. 10.28 s > /nix/store/8q2s09jza1l7wqhq4i0sqrkqmsx0ldiz-schema-dot-org-jsonld-0.0.0.0/lib/ghc-9.10.3/lib/x86_64-linux-ghc-9.10.3-21af
  323. 10.28 s > Private executables installed in:
  324. 10.28 s > /nix/store/8q2s09jza1l7wqhq4i0sqrkqmsx0ldiz-schema-dot-org-jsonld-0.0.0.0/libexec/x86_64-linux-ghc-9.10.3-21af/schema-dot-org-jsonld-0.0.0.0
  325. 10.28 s > Data files installed in:
  326. 10.28 s > /nix/store/8q2s09jza1l7wqhq4i0sqrkqmsx0ldiz-schema-dot-org-jsonld-0.0.0.0/share/x86_64-linux-ghc-9.10.3-21af/schema-dot-org-jsonld-0.0.0.0
  327. 10.28 s > Documentation installed in:
  328. 10.28 s > /nix/store/nicsxijpgvgpw191gz23d9r192p566w0-schema-dot-org-jsonld-0.0.0.0-doc/share/doc/schema-dot-org-jsonld-0.0.0.0
  329. 10.28 s > Configuration files installed in:
  330. 10.28 s > /nix/store/8q2s09jza1l7wqhq4i0sqrkqmsx0ldiz-schema-dot-org-jsonld-0.0.0.0/etc
  331. 10.28 s > No alex found
  332. 10.28 s > Using ar found on system at:
  333. 10.28 s > /nix/store/mbyy19mdwnfvfwmdi0gqgggx0njvpl1w-binutils-wrapper-2.46/bin/ar
  334. 10.28 s > No c2hs found
  335. 10.28 s > No cpphs found
  336. 10.28 s > No doctest found
  337. 10.28 s > Using gcc version 15.2.0 given by user at:
  338. 10.28 s > /nix/store/788mx070y81zjlg5ipcl0cra3afviw9k-gcc-wrapper-15.2.0/bin/gcc
  339. 10.28 s > Using ghc version 9.10.3 found on system at:
  340. 10.28 s > /nix/store/k493jzz83044mqayvlb6247l35780kxy-ghc-9.10.3/bin/ghc
  341. 10.28 s > Using ghc-pkg version 9.10.3 found on system at:
  342. 10.28 s > /nix/store/k493jzz83044mqayvlb6247l35780kxy-ghc-9.10.3/bin/ghc-pkg-9.10.3
  343. 10.28 s > No ghcjs found
  344. 10.28 s > No ghcjs-pkg found
  345. 10.28 s > No greencard found
  346. 10.28 s > Using haddock version 2.31.1 found on system at:
  347. 10.28 s > /nix/store/k493jzz83044mqayvlb6247l35780kxy-ghc-9.10.3/bin/haddock-ghc-9.10.3
  348. 10.28 s > No happy found
  349. 10.28 s > Using haskell-suite found on system at: haskell-suite-dummy-location
  350. 10.28 s > Using haskell-suite-pkg found on system at: haskell-suite-pkg-dummy-location
  351. 10.28 s > No hmake found
  352. 10.28 s > Using hpc version 0.69 found on system at:
  353. 10.28 s > /nix/store/k493jzz83044mqayvlb6247l35780kxy-ghc-9.10.3/bin/hpc-ghc-9.10.3
  354. 10.28 s > Using hsc2hs version 0.68.10 found on system at:
  355. 10.28 s > /nix/store/k493jzz83044mqayvlb6247l35780kxy-ghc-9.10.3/bin/hsc2hs-ghc-9.10.3
  356. 10.28 s > Using hscolour version 1.25 found on system at:
  357. 10.28 s > /nix/store/hvlf3xzdw0p5s3kybdkch6iqyz0740rc-hscolour-1.25/bin/HsColour
  358. 10.28 s > No jhc found
  359. 10.28 s > Using ld found on system at:
  360. 10.28 s > /nix/store/788mx070y81zjlg5ipcl0cra3afviw9k-gcc-wrapper-15.2.0/bin/ld
  361. 10.28 s > No pkg-config found
  362. 10.28 s > Using runghc version 9.10.3 found on system at:
  363. 10.28 s > /nix/store/k493jzz83044mqayvlb6247l35780kxy-ghc-9.10.3/bin/runghc-9.10.3
  364. 10.28 s > Using strip version 2.46 found on system at:
  365. 10.28 s > /nix/store/788mx070y81zjlg5ipcl0cra3afviw9k-gcc-wrapper-15.2.0/bin/strip
  366. 10.28 s > Using tar found on system at:
  367. 10.28 s > /nix/store/k5akwnrn9x2afaj2va7g4a2zpdim8l43-gnutar-1.35/bin/tar
  368. 10.28 s > No uhc found
  369. 10.28 s > Running phase: buildPhase
  370. 10.28 s > Preprocessing library for schema-dot-org-jsonld-0.0.0.0...
  371. 10.28 s > Building library for schema-dot-org-jsonld-0.0.0.0...
  372. 10.28 s > [1 of 5] Compiling Paths_schema_dot_org_jsonld ( dist/build/autogen/Paths_schema_dot_org_jsonld.hs, dist/build/Paths_schema_dot_org_jsonld.o, dist/build/Paths_schema_dot_org_jsonld.dyn_o )
  373. 10.28 s > [2 of 5] Compiling SchemaDotOrg.JSONLD.Parse ( src/SchemaDotOrg/JSONLD/Parse.hs, dist/build/SchemaDotOrg/JSONLD/Parse.o, dist/build/SchemaDotOrg/JSONLD/Parse.dyn_o )
  374. 10.28 s > [3 of 5] Compiling SchemaDotOrg.JSONLD.Render ( src/SchemaDotOrg/JSONLD/Render.hs, dist/build/SchemaDotOrg/JSONLD/Render.o, dist/build/SchemaDotOrg/JSONLD/Render.dyn_o )
  375. 10.28 s > [4 of 5] Compiling SchemaDotOrg.JSONLD.Tagsoup ( src/SchemaDotOrg/JSONLD/Tagsoup.hs, dist/build/SchemaDotOrg/JSONLD/Tagsoup.o, dist/build/SchemaDotOrg/JSONLD/Tagsoup.dyn_o )
  376. 10.28 s > [5 of 5] Compiling SchemaDotOrg.JSONLD ( src/SchemaDotOrg/JSONLD.hs, dist/build/SchemaDotOrg/JSONLD.o, dist/build/SchemaDotOrg/JSONLD.dyn_o )
  377. 10.28 s > [1 of 5] Compiling Paths_schema_dot_org_jsonld ( dist/build/autogen/Paths_schema_dot_org_jsonld.hs, dist/build/Paths_schema_dot_org_jsonld.p_o )
  378. 10.28 s > [2 of 5] Compiling SchemaDotOrg.JSONLD.Parse ( src/SchemaDotOrg/JSONLD/Parse.hs, dist/build/SchemaDotOrg/JSONLD/Parse.p_o )
  379. 10.28 s > [3 of 5] Compiling SchemaDotOrg.JSONLD.Render ( src/SchemaDotOrg/JSONLD/Render.hs, dist/build/SchemaDotOrg/JSONLD/Render.p_o )
  380. 10.28 s > [4 of 5] Compiling SchemaDotOrg.JSONLD.Tagsoup ( src/SchemaDotOrg/JSONLD/Tagsoup.hs, dist/build/SchemaDotOrg/JSONLD/Tagsoup.p_o )
  381. 10.28 s > [5 of 5] Compiling SchemaDotOrg.JSONLD ( src/SchemaDotOrg/JSONLD.hs, dist/build/SchemaDotOrg/JSONLD.p_o )
  382. 10.28 s > Preprocessing test suite 'schema-dot-org-jsonld-test' for schema-dot-org-jsonld-0.0.0.0...
  383. 10.28 s > Building test suite 'schema-dot-org-jsonld-test' for schema-dot-org-jsonld-0.0.0.0...
  384. 10.28 s > [1 of 3] Compiling Paths_schema_dot_org_jsonld ( dist/build/schema-dot-org-jsonld-test/autogen/Paths_schema_dot_org_jsonld.hs, dist/build/schema-dot-org-jsonld-test/schema-dot-org-jsonld-test-tmp/Paths_schema_dot_org_jsonld.o )
  385. 10.28 s > [2 of 3] Compiling SchemaDotOrg.JSONLD.TagsoupSpec ( test/SchemaDotOrg/JSONLD/TagsoupSpec.hs, dist/build/schema-dot-org-jsonld-test/schema-dot-org-jsonld-test-tmp/SchemaDotOrg/JSONLD/TagsoupSpec.o )
  386. 10.28 s > test/SchemaDotOrg/JSONLD/TagsoupSpec.hs:33:25: error: [GHC-83865]
  387. 10.28 s > • Couldn't match type: Path.Internal.Posix.Path
  388. 10.28 s > Path.Posix.Rel Path.Posix.Dir
  389. 10.28 s > with: [Char]
  390. 10.28 s > Expected: FilePath
  391. 10.28 s > Actual: Path.Internal.Posix.Path Path.Posix.Rel Path.Posix.Dir
  392. 10.28 s > • In the first argument of ‘scenarioDir’, namely
  393. 10.28 s > ‘(Path.Internal.Posix.Path "test_resources/" ::
  394. 10.28 s > Path.Internal.Posix.Path Path.Posix.Rel Path.Posix.Dir)’
  395. 10.28 s > In the first argument of ‘($)’, namely
  396. 10.28 s > ‘scenarioDir
  397. 10.28 s > (Path.Internal.Posix.Path "test_resources/" ::
  398. 10.28 s > Path.Internal.Posix.Path Path.Posix.Rel Path.Posix.Dir)’
  399. 10.28 s > In the second argument of ‘($)’, namely
  400. 10.28 s > ‘scenarioDir
  401. 10.28 s > (Path.Internal.Posix.Path "test_resources/" ::
  402. 10.28 s > Path.Internal.Posix.Path Path.Posix.Rel Path.Posix.Dir)
  403. 10.28 s > $ \ file
  404. 10.28 s > -> when (fileExtension file == Just ".html")
  405. 10.28 s > $ do let ...
  406. 10.28 s > it (unwords [...]) $ do ...’
  407. 10.28 s > |
  408. 10.28 s > 33 | scenarioDir [reldir|test_resources|] $ \file ->
  409. 10.28 s > | ^^^^^^^^^^^^^^^^
  410. 10.28 s >
  411. 10.28 s > test/SchemaDotOrg/JSONLD/TagsoupSpec.hs:34:27: error: [GHC-83865]
  412. 10.28 s > • Couldn't match type: [Char]
  413. 10.28 s > with: Path.Internal.Posix.Path b0 Path.Posix.File
  414. 10.28 s > Expected: Path.Internal.Posix.Path b0 Path.Posix.File
  415. 10.28 s > Actual: FilePath
  416. 10.28 s > • In the first argument of ‘fileExtension’, namely ‘file’
  417. 10.28 s > In the first argument of ‘(==)’, namely ‘fileExtension file’
  418. 10.28 s > In the first argument of ‘when’, namely
  419. 10.28 s > ‘(fileExtension file == Just ".html")’
  420. 10.28 s > |
  421. 10.28 s > 34 | when (fileExtension file == Just ".html") $ do
  422. 10.28 s > | ^^^^
  423. 10.28 s >
  424. 10.28 s > test/SchemaDotOrg/JSONLD/TagsoupSpec.hs:35:30: error: [GHC-83865]
  425. 10.28 s > • Couldn't match type: [Char]
  426. 10.28 s > with: Path.Internal.Posix.Path Path.Posix.Rel Path.Posix.File
  427. 10.28 s > Expected: Path.Internal.Posix.Path Path.Posix.Rel Path.Posix.File
  428. 10.28 s > Actual: FilePath
  429. 10.28 s > • In the first argument of ‘fromRelFile’, namely ‘file’
  430. 10.28 s > In the expression: fromRelFile file
  431. 10.28 s > In an equation for ‘fp’: fp = fromRelFile file
  432. 10.28 s > |
  433. 10.28 s > 35 | let fp = fromRelFile file
  434. 10.28 s > | ^^^^
  435. 10.28 s >
  436. 10.28 s For full logs, run:
  437. 10.28 s nix log /nix/store/b7wxkz1av6hmgals5h16625kcxfjpvyg-schema-dot-org-jsonld-0.0.0.0.drv
  438. 10.30 s Build failed.