1. 0.00 s $ /nix/store/9ypz3flqsrl5xl495mm8h645gadjsxi1-coreutils-9.11/bin/timeout --kill-after=15s 7200s /nix/store/23zk8sgzamrbmj1fday15szf7f2279s8-nix-2.34.7/bin/nix --extra-experimental-features nix-command --extra-experimental-features flakes --log-format internal-json build --no-link --print-out-paths git+https://github.com/NorfairKing/schema-dot-org?ref=refs%2Fpull%2F1%2Fmerge&rev=64d6e1ea54fbc3b9846955da29886f0bfbd3f79b&shallow=1#packages.x86_64-linux.jsonld --print-build-logs
  2. 0.08 s fetching Git repository 'https://github.com/NorfairKing/schema-dot-org'
  3. 0.67 s remote: Enumerating objects: 94, done.
  4. 0.67 s remote: Counting objects: 1% (1/94) remote: Counting objects: 2% (2/94) remote: Counting objects: 3% (3/94) remote: Counting objects: 4% (4/94) remote: Counting objects: 5% (5/94) remote: Counting objects: 6% (6/94) remote: Counting objects: 7% (7/94) remote: Counting objects: 8% (8/94) remote: Counting objects: 9% (9/94) remote: Counting objects: 10% (10/94) remote: Counting objects: 11% (11/94) remote: Counting objects: 12% (12/94) remote: Counting objects: 13% (13/94) remote: Counting objects: 14% (14/94) remote: Counting objects: 15% (15/94) remote: Counting objects: 17% (16/94) remote: Counting objects: 18% (17/94) remote: Counting objects: 19% (18/94) remote: Counting objects: 20% (19/94) remote: Counting objects: 21% (20/94) remote: Counting objects: 22% (21/94) remote: Counting objects: 23% (22/94) remote: Counting objects: 24% (23/94) remote: Counting objects: 25% (24/94) remote: Counting objects: 26% (25/94) remote: Counting objects: 27% (26/94) remote: Counting objects: 28% (27/94) remote: Counting objects: 29% (28/94) remote: Counting objects: 30% (29/94) remote: Counting objects: 31% (30/94) remote: Counting objects: 32% (31/94) remote: Counting objects: 34% (32/94) remote: Counting objects: 35% (33/94) remote: Counting objects: 36% (34/94) remote: Counting objects: 37% (35/94) remote: Counting objects: 38% (36/94) remote: Counting objects: 39% (37/94) remote: Counting objects: 40% (38/94) remote: Counting objects: 41% (39/94) remote: Counting objects: 42% (40/94) remote: Counting objects: 43% (41/94) remote: Counting objects: 44% (42/94) remote: Counting objects: 45% (43/94) remote: Counting objects: 46% (44/94) remote: Counting objects: 47% (45/94) remote: Counting objects: 48% (46/94) remote: Counting objects: 50% (47/94) remote: Counting objects: 51% (48/94) remote: Counting objects: 52% (49/94) remote: Counting objects: 53% (50/94) remote: Counting objects: 54% (51/94) remote: Counting objects: 55% (52/94) remote: Counting objects: 56% (53/94) remote: Counting objects: 57% (54/94) remote: Counting objects: 58% (55/94) remote: Counting objects: 59% (56/94) remote: Counting objects: 60% (57/94) remote: Counting objects: 61% (58/94) remote: Counting objects: 62% (59/94) remote: Counting objects: 63% (60/94) remote: Counting objects: 64% (61/94) remote: Counting objects: 65% (62/94) remote: Counting objects: 67% (63/94) remote: Counting objects: 68% (64/94) remote: Counting objects: 69% (65/94) remote: Counting objects: 70% (66/94) remote: Counting objects: 71% (67/94) remote: Counting objects: 72% (68/94) remote: Counting objects: 73% (69/94) remote: Counting objects: 74% (70/94) remote: Counting objects: 75% (71/94) remote: Counting objects: 76% (72/94) remote: Counting objects: 77% (73/94) remote: Counting objects: 78% (74/94) remote: Counting objects: 79% (75/94) remote: Counting objects: 80% (76/94) remote: Counting objects: 81% (77/94) remote: Counting objects: 82% (78/94) remote: Counting objects: 84% (79/94) remote: Counting objects: 85% (80/94) remote: Counting objects: 86% (81/94) remote: Counting objects: 87% (82/94) remote: Counting objects: 88% (83/94) remote: Counting objects: 89% (84/94) remote: Counting objects: 90% (85/94) remote: Counting objects: 91% (86/94) remote: Counting objects: 92% (87/94) remote: Counting objects: 93% (88/94) remote: Counting objects: 94% (89/94) remote: Counting objects: 95% (90/94) remote: Counting objects: 96% (91/94) remote: Counting objects: 97% (92/94) remote: Counting objects: 98% (93/94) remote: Counting objects: 100% (94/94) remote: Counting objects: 100% (94/94), done.
  5. 0.68 s remote: Compressing objects: 1% (1/78) remote: Compressing objects: 2% (2/78) remote: Compressing objects: 3% (3/78) remote: Compressing objects: 5% (4/78) remote: Compressing objects: 6% (5/78) remote: Compressing objects: 7% (6/78) remote: Compressing objects: 8% (7/78) remote: Compressing objects: 10% (8/78) remote: Compressing objects: 11% (9/78) remote: Compressing objects: 12% (10/78) remote: Compressing objects: 14% (11/78) remote: Compressing objects: 15% (12/78) remote: Compressing objects: 16% (13/78) remote: Compressing objects: 17% (14/78) remote: Compressing objects: 19% (15/78) remote: Compressing objects: 20% (16/78) remote: Compressing objects: 21% (17/78) remote: Compressing objects: 23% (18/78) remote: Compressing objects: 24% (19/78) remote: Compressing objects: 25% (20/78) remote: Compressing objects: 26% (21/78) remote: Compressing objects: 28% (22/78) remote: Compressing objects: 29% (23/78) remote: Compressing objects: 30% (24/78) remote: Compressing objects: 32% (25/78) remote: Compressing objects: 33% (26/78) remote: Compressing objects: 34% (27/78) remote: Compressing objects: 35% (28/78) remote: Compressing objects: 37% (29/78) remote: Compressing objects: 38% (30/78) remote: Compressing objects: 39% (31/78) remote: Compressing objects: 41% (32/78) remote: Compressing objects: 42% (33/78) remote: Compressing objects: 43% (34/78) remote: Compressing objects: 44% (35/78) remote: Compressing objects: 46% (36/78) remote: Compressing objects: 47% (37/78) remote: Compressing objects: 48% (38/78) remote: Compressing objects: 50% (39/78) remote: Compressing objects: 51% (40/78) remote: Compressing objects: 52% (41/78) remote: Compressing objects: 53% (42/78) remote: Compressing objects: 55% (43/78) remote: Compressing objects: 56% (44/78) remote: Compressing objects: 57% (45/78) remote: Compressing objects: 58% (46/78) remote: Compressing objects: 60% (47/78) remote: Compressing objects: 61% (48/78) remote: Compressing objects: 62% (49/78) remote: Compressing objects: 64% (50/78) remote: Compressing objects: 65% (51/78) remote: Compressing objects: 66% (52/78) remote: Compressing objects: 67% (53/78) remote: Compressing objects: 69% (54/78) remote: Compressing objects: 70% (55/78) remote: Compressing objects: 71% (56/78) remote: Compressing objects: 73% (57/78) remote: Compressing objects: 74% (58/78) remote: Compressing objects: 75% (59/78) remote: Compressing objects: 76% (60/78) remote: Compressing objects: 78% (61/78) remote: Compressing objects: 79% (62/78) remote: Compressing objects: 80% (63/78) remote: Compressing objects: 82% (64/78) remote: Compressing objects: 83% (65/78) remote: Compressing objects: 84% (66/78) remote: Compressing objects: 85% (67/78) remote: Compressing objects: 87% (68/78) remote: Compressing objects: 88% (69/78) remote: Compressing objects: 89% (70/78) remote: Compressing objects: 91% (71/78) remote: Compressing objects: 92% (72/78) remote: Compressing objects: 93% (73/78) remote: Compressing objects: 94% (74/78) remote: Compressing objects: 96% (75/78) remote: Compressing objects: 97% (76/78) remote: Compressing objects: 98% (77/78) remote: Compressing objects: 100% (78/78) remote: Compressing objects: 100% (78/78), done.
  6. 0.70 s Unpacking objects: 1% (1/94) Unpacking objects: 2% (2/94) Unpacking objects: 3% (3/94) Unpacking objects: 4% (4/94) Unpacking objects: 5% (5/94) Unpacking objects: 6% (6/94) Unpacking objects: 7% (7/94) Unpacking objects: 8% (8/94) Unpacking objects: 9% (9/94) Unpacking objects: 10% (10/94) Unpacking objects: 11% (11/94) Unpacking objects: 12% (12/94) Unpacking objects: 13% (13/94) Unpacking objects: 14% (14/94) Unpacking objects: 15% (15/94) Unpacking objects: 17% (16/94) Unpacking objects: 18% (17/94) Unpacking objects: 19% (18/94) Unpacking objects: 20% (19/94) Unpacking objects: 21% (20/94) Unpacking objects: 22% (21/94) Unpacking objects: 23% (22/94) Unpacking objects: 24% (23/94) Unpacking objects: 25% (24/94) Unpacking objects: 26% (25/94) Unpacking objects: 27% (26/94) Unpacking objects: 28% (27/94) Unpacking objects: 29% (28/94) Unpacking objects: 30% (29/94) Unpacking objects: 31% (30/94) Unpacking objects: 32% (31/94) Unpacking objects: 34% (32/94) Unpacking objects: 35% (33/94) Unpacking objects: 36% (34/94) Unpacking objects: 37% (35/94) Unpacking objects: 38% (36/94) Unpacking objects: 39% (37/94) Unpacking objects: 40% (38/94) Unpacking objects: 41% (39/94) Unpacking objects: 42% (40/94) Unpacking objects: 43% (41/94) Unpacking objects: 44% (42/94) Unpacking objects: 45% (43/94) Unpacking objects: 46% (44/94) Unpacking objects: 47% (45/94) Unpacking objects: 48% (46/94) Unpacking objects: 50% (47/94) Unpacking objects: 51% (48/94) Unpacking objects: 52% (49/94) Unpacking objects: 53% (50/94) Unpacking objects: 54% (51/94) Unpacking objects: 55% (52/94) Unpacking objects: 56% (53/94) Unpacking objects: 57% (54/94) Unpacking objects: 58% (55/94) Unpacking objects: 59% (56/94) Unpacking objects: 60% (57/94) Unpacking objects: 61% (58/94) Unpacking objects: 62% (59/94) Unpacking objects: 63% (60/94) Unpacking objects: 64% (61/94) Unpacking objects: 65% (62/94) Unpacking objects: 67% (63/94) Unpacking objects: 68% (64/94) Unpacking objects: 69% (65/94) Unpacking objects: 70% (66/94) Unpacking objects: 71% (67/94) Unpacking objects: 72% (68/94) Unpacking objects: 73% (69/94) Unpacking objects: 74% (70/94) Unpacking objects: 75% (71/94) Unpacking objects: 76% (72/94) Unpacking objects: 77% (73/94) Unpacking objects: 78% (74/94) Unpacking objects: 79% (75/94) Unpacking objects: 80% (76/94) Unpacking objects: 81% (77/94) Unpacking objects: 82% (78/94) Unpacking objects: 84% (79/94) Unpacking objects: 85% (80/94) Unpacking objects: 86% (81/94) Unpacking objects: 87% (82/94) Unpacking objects: 88% (83/94) Unpacking objects: 89% (84/94) Unpacking objects: 90% (85/94) Unpacking objects: 91% (86/94) Unpacking objects: 92% (87/94) Unpacking objects: 93% (88/94) Unpacking objects: 94% (89/94) Unpacking objects: 95% (90/94) remote: Total 94 (delta 4), reused 59 (delta 1), pack-reused 0 (from 0)
  7. 0.70 s Unpacking objects: 96% (91/94) Unpacking objects: 97% (92/94) Unpacking objects: 98% (93/94) Unpacking objects: 100% (94/94) Unpacking objects: 100% (94/94), 116.80 KiB | 6.15 MiB/s, done.
  8. 0.70 s From https://github.com/NorfairKing/schema-dot-org
  9. 0.70 s * branch 64d6e1ea54fbc3b9846955da29886f0bfbd3f79b -> FETCH_HEAD
  10. 1.77 s
  11. 1.92 s Downloading cached schema-dot-org-jsonld-source from https://cache.staging.nix-ci.com
  12. 1.95 s Downloaded cached schema-dot-org-jsonld-source (15 KiB) in 26ms
  13. 1.95 s Progress: 0 of 2 built, 1 of 1 downloaded from cache
  14. 2.04 s Building /nix/store/b7wxkz1av6hmgals5h16625kcxfjpvyg-schema-dot-org-jsonld-0.0.0.0.drv
  15. 2.36 s [schema-dot-org-jsonld] Phase: setupCompilerEnvironmentPhase
  16. 2.37 s [schema-dot-org-jsonld] Build with /nix/store/k493jzz83044mqayvlb6247l35780kxy-ghc-9.10.3.
  17. 3.11 s [schema-dot-org-jsonld] Phase: unpackPhase
  18. 3.11 s [schema-dot-org-jsonld] unpacking source archive /nix/store/9q5dm03axrmxqhm6x7iqpyv5947n8j8l-schema-dot-org-jsonld-source-0.0.0.0/schema-dot-org-jsonld-0.0.0.0.tar.gz
  19. 3.13 s [schema-dot-org-jsonld] source root is schema-dot-org-jsonld-0.0.0.0
  20. 3.14 s [schema-dot-org-jsonld] setting SOURCE_DATE_EPOCH to timestamp 1788936908 of file "schema-dot-org-jsonld-0.0.0.0/test/Spec.hs"
  21. 3.14 s [schema-dot-org-jsonld] warning: file "schema-dot-org-jsonld-0.0.0.0/test/Spec.hs" may be generated; SOURCE_DATE_EPOCH may be non-deterministic
  22. 3.15 s [schema-dot-org-jsonld] Phase: patchPhase
  23. 3.17 s [schema-dot-org-jsonld] Phase: compileBuildDriverPhase
  24. 3.18 s [schema-dot-org-jsonld] setupCompileFlags: -package-db=/build/tmp.h3zVNPavfA/setup-package.conf.d -threaded
  25. 3.23 s [schema-dot-org-jsonld] [1 of 2] Compiling Main ( Setup.hs, /build/tmp.h3zVNPavfA/Main.o )
  26. 3.29 s [schema-dot-org-jsonld] [2 of 2] Linking Setup
  27. 4.60 s [schema-dot-org-jsonld] Phase: updateAutotoolsGnuConfigScriptsPhase
  28. 4.63 s [schema-dot-org-jsonld] Phase: configurePhase
  29. 4.63 s [schema-dot-org-jsonld] configureFlags: --verbose --prefix=/nix/store/8q2s09jza1l7wqhq4i0sqrkqmsx0ldiz-schema-dot-org-jsonld-0.0.0.0 --libdir=$prefix/lib/$compiler/lib --libsubdir=$abi/$libname --docdir=/nix/store/nicsxijpgvgpw191gz23d9r192p566w0-schema-dot-org-jsonld-0.0.0.0-doc/share/doc/schema-dot-org-jsonld-0.0.0.0 --with-gcc=gcc --package-db=/build/tmp.h3zVNPavfA/package.conf.d --ghc-option=-j14 --ghc-option=+RTS --ghc-option=-A64M --ghc-option=-RTS --enable-library-profiling --profiling-detail=exported-functions --disable-profiling --enable-shared --disable-coverage --enable-static --disable-executable-dynamic --enable-tests --disable-benchmarks --enable-library-vanilla --disable-library-for-ghci --enable-split-sections --enable-library-stripping --enable-executable-stripping --ghc-option=-haddock --ghc-option=-Wall --ghc-option=-Werror --extra-lib-dirs=/nix/store/wl2nw5l4x4dg6kclbgpq7v9212i1s6cy-ncurses-6.6/lib --extra-lib-dirs=/nix/store/2zs4bbi72plfm8j6zxf1js4f3yc4yzwy-libffi-3.5.2/lib --extra-lib-dirs=/nix/store/qhmqdg27kcrlkl8ida6d5hiacw0y8d21-elfutils-0.194/lib --extra-lib-dirs=/nix/store/y56aqb1m3y5davn6hsv4jfbml78qw4mv-gmp-with-cxx-6.3.0/lib --extra-lib-dirs=/nix/store/wjfhh11sfcdf97mvg7hbxickybxzk850-numactl-2.0.18/lib
  30. 4.65 s [schema-dot-org-jsonld] Using Parsec parser
  31. 4.65 s [schema-dot-org-jsonld] Configuring schema-dot-org-jsonld-0.0.0.0...
  32. 5.45 s [schema-dot-org-jsonld] Dependency aeson: using aeson-2.2.4.1
  33. 5.45 s [schema-dot-org-jsonld] Dependency base >=4.7 && <5: using base-4.20.2.0
  34. 5.45 s [schema-dot-org-jsonld] Dependency bytestring: using bytestring-0.12.2.0
  35. 5.45 s [schema-dot-org-jsonld] Dependency schema-dot-org: using schema-dot-org-0.0.0.0
  36. 5.45 s [schema-dot-org-jsonld] Dependency tagsoup: using tagsoup-0.14.8
  37. 5.45 s [schema-dot-org-jsonld] Dependency text: using text-2.1.3
  38. 5.45 s [schema-dot-org-jsonld] Dependency vector: using vector-0.13.2.0
  39. 5.45 s [schema-dot-org-jsonld] Dependency aeson: using aeson-2.2.4.1
  40. 5.45 s [schema-dot-org-jsonld] Dependency base >=4.7 && <5: using base-4.20.2.0
  41. 5.45 s [schema-dot-org-jsonld] Dependency bytestring: using bytestring-0.12.2.0
  42. 5.45 s [schema-dot-org-jsonld] Dependency path: using path-0.9.6
  43. 5.45 s [schema-dot-org-jsonld] Dependency schema-dot-org-jsonld: using schema-dot-org-jsonld-0.0.0.0
  44. 5.45 s [schema-dot-org-jsonld] Dependency sydtest: using sydtest-0.20.0.1
  45. 5.45 s [schema-dot-org-jsonld] Dependency sydtest-aeson: using sydtest-aeson-0.2.0.1
  46. 5.45 s [schema-dot-org-jsonld] Source component graph:
  47. 5.45 s [schema-dot-org-jsonld] component lib
  48. 5.45 s [schema-dot-org-jsonld] component test:schema-dot-org-jsonld-test dependency lib
  49. 5.45 s [schema-dot-org-jsonld] Configured component graph:
  50. 5.45 s [schema-dot-org-jsonld] component schema-dot-org-jsonld-0.0.0.0-IFXBqy7zHoeF7tncdo1uxB
  51. 5.45 s [schema-dot-org-jsonld] include aeson-2.2.4.1-I5kgiCyiPJO8jEV0bEgUez
  52. 5.45 s [schema-dot-org-jsonld] include base-4.20.2.0-4d66
  53. 5.45 s [schema-dot-org-jsonld] include bytestring-0.12.2.0-25ef
  54. 5.45 s [schema-dot-org-jsonld] include schema-dot-org-0.0.0.0-DK3bNdhkDmvFOAaebGqsq5
  55. 5.45 s [schema-dot-org-jsonld] include tagsoup-0.14.8-BsqbPSEZh9W5mB1CzgSWho
  56. 5.45 s [schema-dot-org-jsonld] include text-2.1.3-3f03
  57. 5.45 s [schema-dot-org-jsonld] include vector-0.13.2.0-4sNODSde54Y5T3xVFmV0fE
  58. 5.45 s [schema-dot-org-jsonld] component schema-dot-org-jsonld-0.0.0.0-Cu5ewoR91fM6pMI6cAFpDW-schema-dot-org-jsonld-test
  59. 5.45 s [schema-dot-org-jsonld] include aeson-2.2.4.1-I5kgiCyiPJO8jEV0bEgUez
  60. 5.45 s [schema-dot-org-jsonld] include base-4.20.2.0-4d66
  61. 5.45 s [schema-dot-org-jsonld] include bytestring-0.12.2.0-25ef
  62. 5.45 s [schema-dot-org-jsonld] include path-0.9.6-L3t3TcndY3P7bshtU9371n
  63. 5.45 s [schema-dot-org-jsonld] include schema-dot-org-jsonld-0.0.0.0-IFXBqy7zHoeF7tncdo1uxB
  64. 5.45 s [schema-dot-org-jsonld] include sydtest-0.20.0.1-Jo2KtBwwg0M2hH86LVxxcs
  65. 5.45 s [schema-dot-org-jsonld] include sydtest-aeson-0.2.0.1-AEtebtKhgEIKIZK2rvdpfT
  66. 5.45 s [schema-dot-org-jsonld] Linked component graph:
  67. 5.45 s [schema-dot-org-jsonld] unit schema-dot-org-jsonld-0.0.0.0-IFXBqy7zHoeF7tncdo1uxB
  68. 5.45 s [schema-dot-org-jsonld] include aeson-2.2.4.1-I5kgiCyiPJO8jEV0bEgUez
  69. 5.45 s [schema-dot-org-jsonld] include base-4.20.2.0-4d66
  70. 5.45 s [schema-dot-org-jsonld] include bytestring-0.12.2.0-25ef
  71. 5.45 s [schema-dot-org-jsonld] include schema-dot-org-0.0.0.0-DK3bNdhkDmvFOAaebGqsq5
  72. 5.45 s [schema-dot-org-jsonld] include tagsoup-0.14.8-BsqbPSEZh9W5mB1CzgSWho
  73. 5.45 s [schema-dot-org-jsonld] include text-2.1.3-3f03
  74. 5.45 s [schema-dot-org-jsonld] include vector-0.13.2.0-4sNODSde54Y5T3xVFmV0fE
  75. 5.45 s [schema-dot-org-jsonld] SchemaDotOrg.JSONLD=schema-dot-org-jsonld-0.0.0.0-IFXBqy7zHoeF7tncdo1uxB:SchemaDotOrg.JSONLD,SchemaDotOrg.JSONLD.Parse=schema-dot-org-jsonld-0.0.0.0-IFXBqy7zHoeF7tncdo1uxB:SchemaDotOrg.JSONLD.Parse,SchemaDotOrg.JSONLD.Render=schema-dot-org-jsonld-0.0.0.0-IFXBqy7zHoeF7tncdo1uxB:SchemaDotOrg.JSONLD.Render,SchemaDotOrg.JSONLD.Tagsoup=schema-dot-org-jsonld-0.0.0.0-IFXBqy7zHoeF7tncdo1uxB:SchemaDotOrg.JSONLD.Tagsoup
  76. 5.45 s [schema-dot-org-jsonld] unit schema-dot-org-jsonld-0.0.0.0-Cu5ewoR91fM6pMI6cAFpDW-schema-dot-org-jsonld-test
  77. 5.45 s [schema-dot-org-jsonld] include aeson-2.2.4.1-I5kgiCyiPJO8jEV0bEgUez
  78. 5.45 s [schema-dot-org-jsonld] include base-4.20.2.0-4d66
  79. 5.45 s [schema-dot-org-jsonld] include bytestring-0.12.2.0-25ef
  80. 5.45 s [schema-dot-org-jsonld] include path-0.9.6-L3t3TcndY3P7bshtU9371n
  81. 5.45 s [schema-dot-org-jsonld] include schema-dot-org-jsonld-0.0.0.0-IFXBqy7zHoeF7tncdo1uxB
  82. 5.45 s [schema-dot-org-jsonld] include sydtest-0.20.0.1-Jo2KtBwwg0M2hH86LVxxcs
  83. 5.45 s [schema-dot-org-jsonld] include sydtest-aeson-0.2.0.1-AEtebtKhgEIKIZK2rvdpfT
  84. 5.45 s [schema-dot-org-jsonld] Ready component graph:
  85. 5.45 s [schema-dot-org-jsonld] definite schema-dot-org-jsonld-0.0.0.0-IFXBqy7zHoeF7tncdo1uxB
  86. 5.45 s [schema-dot-org-jsonld] depends aeson-2.2.4.1-I5kgiCyiPJO8jEV0bEgUez
  87. 5.45 s [schema-dot-org-jsonld] depends base-4.20.2.0-4d66
  88. 5.45 s [schema-dot-org-jsonld] depends bytestring-0.12.2.0-25ef
  89. 5.45 s [schema-dot-org-jsonld] depends schema-dot-org-0.0.0.0-DK3bNdhkDmvFOAaebGqsq5
  90. 5.45 s [schema-dot-org-jsonld] depends tagsoup-0.14.8-BsqbPSEZh9W5mB1CzgSWho
  91. 5.45 s [schema-dot-org-jsonld] depends text-2.1.3-3f03
  92. 5.45 s [schema-dot-org-jsonld] depends vector-0.13.2.0-4sNODSde54Y5T3xVFmV0fE
  93. 5.45 s [schema-dot-org-jsonld] definite schema-dot-org-jsonld-0.0.0.0-Cu5ewoR91fM6pMI6cAFpDW-schema-dot-org-jsonld-test
  94. 5.45 s [schema-dot-org-jsonld] depends aeson-2.2.4.1-I5kgiCyiPJO8jEV0bEgUez
  95. 5.45 s [schema-dot-org-jsonld] depends base-4.20.2.0-4d66
  96. 5.45 s [schema-dot-org-jsonld] depends bytestring-0.12.2.0-25ef
  97. 5.45 s [schema-dot-org-jsonld] depends path-0.9.6-L3t3TcndY3P7bshtU9371n
  98. 5.45 s [schema-dot-org-jsonld] depends schema-dot-org-jsonld-0.0.0.0-IFXBqy7zHoeF7tncdo1uxB
  99. 5.45 s [schema-dot-org-jsonld] depends sydtest-0.20.0.1-Jo2KtBwwg0M2hH86LVxxcs
  100. 5.45 s [schema-dot-org-jsonld] depends sydtest-aeson-0.2.0.1-AEtebtKhgEIKIZK2rvdpfT
  101. 5.45 s [schema-dot-org-jsonld] Using Cabal-3.12.1.0 compiled by ghc-9.10
  102. 5.45 s [schema-dot-org-jsonld] Using compiler: ghc-9.10.3
  103. 5.45 s [schema-dot-org-jsonld] Using install prefix:
  104. 5.45 s [schema-dot-org-jsonld] /nix/store/8q2s09jza1l7wqhq4i0sqrkqmsx0ldiz-schema-dot-org-jsonld-0.0.0.0
  105. 5.45 s [schema-dot-org-jsonld] Executables installed in:
  106. 5.45 s [schema-dot-org-jsonld] /nix/store/8q2s09jza1l7wqhq4i0sqrkqmsx0ldiz-schema-dot-org-jsonld-0.0.0.0/bin
  107. 5.45 s [schema-dot-org-jsonld] Libraries installed in:
  108. 5.45 s [schema-dot-org-jsonld] /nix/store/8q2s09jza1l7wqhq4i0sqrkqmsx0ldiz-schema-dot-org-jsonld-0.0.0.0/lib/ghc-9.10.3/lib/x86_64-linux-ghc-9.10.3-21af/schema-dot-org-jsonld-0.0.0.0-IFXBqy7zHoeF7tncdo1uxB
  109. 5.45 s [schema-dot-org-jsonld] Dynamic Libraries installed in:
  110. 5.45 s [schema-dot-org-jsonld] /nix/store/8q2s09jza1l7wqhq4i0sqrkqmsx0ldiz-schema-dot-org-jsonld-0.0.0.0/lib/ghc-9.10.3/lib/x86_64-linux-ghc-9.10.3-21af
  111. 5.45 s [schema-dot-org-jsonld] Private executables installed in:
  112. 5.45 s [schema-dot-org-jsonld] /nix/store/8q2s09jza1l7wqhq4i0sqrkqmsx0ldiz-schema-dot-org-jsonld-0.0.0.0/libexec/x86_64-linux-ghc-9.10.3-21af/schema-dot-org-jsonld-0.0.0.0
  113. 5.45 s [schema-dot-org-jsonld] Data files installed in:
  114. 5.45 s [schema-dot-org-jsonld] /nix/store/8q2s09jza1l7wqhq4i0sqrkqmsx0ldiz-schema-dot-org-jsonld-0.0.0.0/share/x86_64-linux-ghc-9.10.3-21af/schema-dot-org-jsonld-0.0.0.0
  115. 5.45 s [schema-dot-org-jsonld] Documentation installed in:
  116. 5.45 s [schema-dot-org-jsonld] /nix/store/nicsxijpgvgpw191gz23d9r192p566w0-schema-dot-org-jsonld-0.0.0.0-doc/share/doc/schema-dot-org-jsonld-0.0.0.0
  117. 5.45 s [schema-dot-org-jsonld] Configuration files installed in:
  118. 5.45 s [schema-dot-org-jsonld] /nix/store/8q2s09jza1l7wqhq4i0sqrkqmsx0ldiz-schema-dot-org-jsonld-0.0.0.0/etc
  119. 5.45 s [schema-dot-org-jsonld] No alex found
  120. 5.45 s [schema-dot-org-jsonld] Using ar found on system at:
  121. 5.45 s [schema-dot-org-jsonld] /nix/store/mbyy19mdwnfvfwmdi0gqgggx0njvpl1w-binutils-wrapper-2.46/bin/ar
  122. 5.45 s [schema-dot-org-jsonld] No c2hs found
  123. 5.45 s [schema-dot-org-jsonld] No cpphs found
  124. 5.45 s [schema-dot-org-jsonld] No doctest found
  125. 5.45 s [schema-dot-org-jsonld] Using gcc version 15.2.0 given by user at:
  126. 5.45 s [schema-dot-org-jsonld] /nix/store/788mx070y81zjlg5ipcl0cra3afviw9k-gcc-wrapper-15.2.0/bin/gcc
  127. 5.45 s [schema-dot-org-jsonld] Using ghc version 9.10.3 found on system at:
  128. 5.45 s [schema-dot-org-jsonld] /nix/store/k493jzz83044mqayvlb6247l35780kxy-ghc-9.10.3/bin/ghc
  129. 5.45 s [schema-dot-org-jsonld] Using ghc-pkg version 9.10.3 found on system at:
  130. 5.45 s [schema-dot-org-jsonld] /nix/store/k493jzz83044mqayvlb6247l35780kxy-ghc-9.10.3/bin/ghc-pkg-9.10.3
  131. 5.45 s [schema-dot-org-jsonld] No ghcjs found
  132. 5.45 s [schema-dot-org-jsonld] No ghcjs-pkg found
  133. 5.45 s [schema-dot-org-jsonld] No greencard found
  134. 5.45 s [schema-dot-org-jsonld] Using haddock version 2.31.1 found on system at:
  135. 5.45 s [schema-dot-org-jsonld] /nix/store/k493jzz83044mqayvlb6247l35780kxy-ghc-9.10.3/bin/haddock-ghc-9.10.3
  136. 5.45 s [schema-dot-org-jsonld] No happy found
  137. 5.45 s [schema-dot-org-jsonld] Using haskell-suite found on system at: haskell-suite-dummy-location
  138. 5.45 s [schema-dot-org-jsonld] Using haskell-suite-pkg found on system at: haskell-suite-pkg-dummy-location
  139. 5.45 s [schema-dot-org-jsonld] No hmake found
  140. 5.45 s [schema-dot-org-jsonld] Using hpc version 0.69 found on system at:
  141. 5.45 s [schema-dot-org-jsonld] /nix/store/k493jzz83044mqayvlb6247l35780kxy-ghc-9.10.3/bin/hpc-ghc-9.10.3
  142. 5.45 s [schema-dot-org-jsonld] Using hsc2hs version 0.68.10 found on system at:
  143. 5.45 s [schema-dot-org-jsonld] /nix/store/k493jzz83044mqayvlb6247l35780kxy-ghc-9.10.3/bin/hsc2hs-ghc-9.10.3
  144. 5.45 s [schema-dot-org-jsonld] Using hscolour version 1.25 found on system at:
  145. 5.45 s [schema-dot-org-jsonld] /nix/store/hvlf3xzdw0p5s3kybdkch6iqyz0740rc-hscolour-1.25/bin/HsColour
  146. 5.45 s [schema-dot-org-jsonld] No jhc found
  147. 5.45 s [schema-dot-org-jsonld] Using ld found on system at:
  148. 5.45 s [schema-dot-org-jsonld] /nix/store/788mx070y81zjlg5ipcl0cra3afviw9k-gcc-wrapper-15.2.0/bin/ld
  149. 5.45 s [schema-dot-org-jsonld] No pkg-config found
  150. 5.45 s [schema-dot-org-jsonld] Using runghc version 9.10.3 found on system at:
  151. 5.45 s [schema-dot-org-jsonld] /nix/store/k493jzz83044mqayvlb6247l35780kxy-ghc-9.10.3/bin/runghc-9.10.3
  152. 5.45 s [schema-dot-org-jsonld] Using strip version 2.46 found on system at:
  153. 5.45 s [schema-dot-org-jsonld] /nix/store/788mx070y81zjlg5ipcl0cra3afviw9k-gcc-wrapper-15.2.0/bin/strip
  154. 5.45 s [schema-dot-org-jsonld] Using tar found on system at:
  155. 5.45 s [schema-dot-org-jsonld] /nix/store/k5akwnrn9x2afaj2va7g4a2zpdim8l43-gnutar-1.35/bin/tar
  156. 5.45 s [schema-dot-org-jsonld] No uhc found
  157. 6.57 s [schema-dot-org-jsonld] Phase: buildPhase
  158. 6.65 s [schema-dot-org-jsonld] Preprocessing library for schema-dot-org-jsonld-0.0.0.0...
  159. 6.65 s [schema-dot-org-jsonld] Building library for schema-dot-org-jsonld-0.0.0.0...
  160. 6.74 s [schema-dot-org-jsonld] [1 of 5] Compiling Paths_schema_dot_org_jsonld ( dist/build/autogen/Paths_schema_dot_org_jsonld.hs, dist/build/Paths_schema_dot_org_jsonld.o, dist/build/Paths_schema_dot_org_jsonld.dyn_o )
  161. 6.91 s [schema-dot-org-jsonld] [2 of 5] Compiling SchemaDotOrg.JSONLD.Parse ( src/SchemaDotOrg/JSONLD/Parse.hs, dist/build/SchemaDotOrg/JSONLD/Parse.o, dist/build/SchemaDotOrg/JSONLD/Parse.dyn_o )
  162. 7.43 s [schema-dot-org-jsonld] [3 of 5] Compiling SchemaDotOrg.JSONLD.Render ( src/SchemaDotOrg/JSONLD/Render.hs, dist/build/SchemaDotOrg/JSONLD/Render.o, dist/build/SchemaDotOrg/JSONLD/Render.dyn_o )
  163. 7.43 s [schema-dot-org-jsonld] [4 of 5] Compiling SchemaDotOrg.JSONLD.Tagsoup ( src/SchemaDotOrg/JSONLD/Tagsoup.hs, dist/build/SchemaDotOrg/JSONLD/Tagsoup.o, dist/build/SchemaDotOrg/JSONLD/Tagsoup.dyn_o )
  164. 7.53 s [schema-dot-org-jsonld] [5 of 5] Compiling SchemaDotOrg.JSONLD ( src/SchemaDotOrg/JSONLD.hs, dist/build/SchemaDotOrg/JSONLD.o, dist/build/SchemaDotOrg/JSONLD.dyn_o )
  165. 7.79 s [schema-dot-org-jsonld] [1 of 5] Compiling Paths_schema_dot_org_jsonld ( dist/build/autogen/Paths_schema_dot_org_jsonld.hs, dist/build/Paths_schema_dot_org_jsonld.p_o )
  166. 8.09 s [schema-dot-org-jsonld] [2 of 5] Compiling SchemaDotOrg.JSONLD.Parse ( src/SchemaDotOrg/JSONLD/Parse.hs, dist/build/SchemaDotOrg/JSONLD/Parse.p_o )
  167. 8.55 s [schema-dot-org-jsonld] [3 of 5] Compiling SchemaDotOrg.JSONLD.Render ( src/SchemaDotOrg/JSONLD/Render.hs, dist/build/SchemaDotOrg/JSONLD/Render.p_o )
  168. 8.55 s [schema-dot-org-jsonld] [4 of 5] Compiling SchemaDotOrg.JSONLD.Tagsoup ( src/SchemaDotOrg/JSONLD/Tagsoup.hs, dist/build/SchemaDotOrg/JSONLD/Tagsoup.p_o )
  169. 8.66 s [schema-dot-org-jsonld] [5 of 5] Compiling SchemaDotOrg.JSONLD ( src/SchemaDotOrg/JSONLD.hs, dist/build/SchemaDotOrg/JSONLD.p_o )
  170. 10.66 s [schema-dot-org-jsonld] Preprocessing test suite 'schema-dot-org-jsonld-test' for schema-dot-org-jsonld-0.0.0.0...
  171. 10.66 s [schema-dot-org-jsonld] Building test suite 'schema-dot-org-jsonld-test' for schema-dot-org-jsonld-0.0.0.0...
  172. 10.78 s [schema-dot-org-jsonld] [1 of 3] Compiling Paths_schema_dot_org_jsonld ( dist/build/schema-dot-org-jsonld-test/autogen/Paths_schema_dot_org_jsonld.hs, dist/build/schema-dot-org-jsonld-test/schema-dot-org-jsonld-test-tmp/Paths_schema_dot_org_jsonld.o )
  173. 11.03 s [schema-dot-org-jsonld] [2 of 3] Compiling SchemaDotOrg.JSONLD.TagsoupSpec ( test/SchemaDotOrg/JSONLD/TagsoupSpec.hs, dist/build/schema-dot-org-jsonld-test/schema-dot-org-jsonld-test-tmp/SchemaDotOrg/JSONLD/TagsoupSpec.o )
  174. 11.03 s [schema-dot-org-jsonld] test/SchemaDotOrg/JSONLD/TagsoupSpec.hs:33:25: error: [GHC-83865]
  175. 11.03 s [schema-dot-org-jsonld] • Couldn't match type: Path.Internal.Posix.Path
  176. 11.03 s [schema-dot-org-jsonld] Path.Posix.Rel Path.Posix.Dir
  177. 11.03 s [schema-dot-org-jsonld] with: [Char]
  178. 11.03 s [schema-dot-org-jsonld] Expected: FilePath
  179. 11.03 s [schema-dot-org-jsonld] Actual: Path.Internal.Posix.Path Path.Posix.Rel Path.Posix.Dir
  180. 11.06 s [schema-dot-org-jsonld] • In the first argument of ‘scenarioDir’, namely
  181. 11.06 s [schema-dot-org-jsonld] ‘(Path.Internal.Posix.Path "test_resources/" ::
  182. 11.06 s [schema-dot-org-jsonld] Path.Internal.Posix.Path Path.Posix.Rel Path.Posix.Dir)’
  183. 11.06 s [schema-dot-org-jsonld] In the first argument of ‘($)’, namely
  184. 11.06 s [schema-dot-org-jsonld] ‘scenarioDir
  185. 11.06 s [schema-dot-org-jsonld] (Path.Internal.Posix.Path "test_resources/" ::
  186. 11.06 s [schema-dot-org-jsonld] Path.Internal.Posix.Path Path.Posix.Rel Path.Posix.Dir)’
  187. 11.06 s [schema-dot-org-jsonld] In the second argument of ‘($)’, namely
  188. 11.06 s [schema-dot-org-jsonld] ‘scenarioDir
  189. 11.06 s [schema-dot-org-jsonld] (Path.Internal.Posix.Path "test_resources/" ::
  190. 11.06 s [schema-dot-org-jsonld] Path.Internal.Posix.Path Path.Posix.Rel Path.Posix.Dir)
  191. 11.06 s [schema-dot-org-jsonld] $ \ file
  192. 11.06 s [schema-dot-org-jsonld] -> when (fileExtension file == Just ".html")
  193. 11.06 s [schema-dot-org-jsonld] $ do let ...
  194. 11.11 s [schema-dot-org-jsonld] it (unwords [...]) $ do ...’
  195. 11.11 s [schema-dot-org-jsonld] |
  196. 11.11 s [schema-dot-org-jsonld] 33 | scenarioDir [reldir|test_resources|] $ \file ->
  197. 11.12 s [schema-dot-org-jsonld] | ^^^^^^^^^^^^^^^^
  198. 11.12 s [schema-dot-org-jsonld]
  199. 11.13 s [schema-dot-org-jsonld] test/SchemaDotOrg/JSONLD/TagsoupSpec.hs:34:27: error: [GHC-83865]
  200. 11.13 s [schema-dot-org-jsonld] • Couldn't match type: [Char]
  201. 11.13 s [schema-dot-org-jsonld] with: Path.Internal.Posix.Path b0 Path.Posix.File
  202. 11.14 s [schema-dot-org-jsonld] Expected: Path.Internal.Posix.Path b0 Path.Posix.File
  203. 11.14 s [schema-dot-org-jsonld] Actual: FilePath
  204. 11.14 s [schema-dot-org-jsonld] • In the first argument of ‘fileExtension’, namely ‘file’
  205. 11.14 s [schema-dot-org-jsonld] In the first argument of ‘(==)’, namely ‘fileExtension file’
  206. 11.14 s [schema-dot-org-jsonld] In the first argument of ‘when’, namely
  207. 11.14 s [schema-dot-org-jsonld] ‘(fileExtension file == Just ".html")’
  208. 11.14 s [schema-dot-org-jsonld] |
  209. 11.14 s [schema-dot-org-jsonld] 34 | when (fileExtension file == Just ".html") $ do
  210. 11.14 s [schema-dot-org-jsonld] | ^^^^
  211. 11.14 s [schema-dot-org-jsonld]
  212. 11.19 s [schema-dot-org-jsonld] test/SchemaDotOrg/JSONLD/TagsoupSpec.hs:35:30: error: [GHC-83865]
  213. 11.19 s [schema-dot-org-jsonld] • Couldn't match type: [Char]
  214. 11.19 s [schema-dot-org-jsonld] with: Path.Internal.Posix.Path Path.Posix.Rel Path.Posix.File
  215. 11.19 s [schema-dot-org-jsonld] Expected: Path.Internal.Posix.Path Path.Posix.Rel Path.Posix.File
  216. 11.19 s [schema-dot-org-jsonld] Actual: FilePath
  217. 11.19 s [schema-dot-org-jsonld] • In the first argument of ‘fromRelFile’, namely ‘file’
  218. 11.19 s [schema-dot-org-jsonld] In the expression: fromRelFile file
  219. 11.19 s [schema-dot-org-jsonld] In an equation for ‘fp’: fp = fromRelFile file
  220. 11.19 s [schema-dot-org-jsonld] |
  221. 11.19 s [schema-dot-org-jsonld] 35 | let fp = fromRelFile file
  222. 11.19 s [schema-dot-org-jsonld] | ^^^^
  223. 11.19 s [schema-dot-org-jsonld]
  224. 11.32 s Progress: 0 of 1 built (1 failed), 1 of 1 downloaded from cache
  225. 11.32 s Failed to build schema-dot-org-jsonld after 9.2s
  226. 11.33 s Cannot build '/nix/store/b7wxkz1av6hmgals5h16625kcxfjpvyg-schema-dot-org-jsonld-0.0.0.0.drv'.
  227. 11.33 s Reason: builder failed with exit code 1.
  228. 11.33 s Output paths:
  229. 11.33 s /nix/store/8q2s09jza1l7wqhq4i0sqrkqmsx0ldiz-schema-dot-org-jsonld-0.0.0.0
  230. 11.33 s /nix/store/nicsxijpgvgpw191gz23d9r192p566w0-schema-dot-org-jsonld-0.0.0.0-doc
  231. 11.33 s Last 209 log lines:
  232. 11.33 s > Running phase: setupCompilerEnvironmentPhase
  233. 11.33 s > Build with /nix/store/k493jzz83044mqayvlb6247l35780kxy-ghc-9.10.3.
  234. 11.33 s > Running phase: unpackPhase
  235. 11.33 s > unpacking source archive /nix/store/9q5dm03axrmxqhm6x7iqpyv5947n8j8l-schema-dot-org-jsonld-source-0.0.0.0/schema-dot-org-jsonld-0.0.0.0.tar.gz
  236. 11.33 s > source root is schema-dot-org-jsonld-0.0.0.0
  237. 11.33 s > setting SOURCE_DATE_EPOCH to timestamp 1788936908 of file "schema-dot-org-jsonld-0.0.0.0/test/Spec.hs"
  238. 11.33 s > warning: file "schema-dot-org-jsonld-0.0.0.0/test/Spec.hs" may be generated; SOURCE_DATE_EPOCH may be non-deterministic
  239. 11.33 s > Running phase: patchPhase
  240. 11.33 s > Running phase: compileBuildDriverPhase
  241. 11.33 s > setupCompileFlags: -package-db=/build/tmp.h3zVNPavfA/setup-package.conf.d -threaded
  242. 11.33 s > [1 of 2] Compiling Main ( Setup.hs, /build/tmp.h3zVNPavfA/Main.o )
  243. 11.33 s > [2 of 2] Linking Setup
  244. 11.33 s > Running phase: updateAutotoolsGnuConfigScriptsPhase
  245. 11.33 s > Running phase: configurePhase
  246. 11.33 s > configureFlags: --verbose --prefix=/nix/store/8q2s09jza1l7wqhq4i0sqrkqmsx0ldiz-schema-dot-org-jsonld-0.0.0.0 --libdir=$prefix/lib/$compiler/lib --libsubdir=$abi/$libname --docdir=/nix/store/nicsxijpgvgpw191gz23d9r192p566w0-schema-dot-org-jsonld-0.0.0.0-doc/share/doc/schema-dot-org-jsonld-0.0.0.0 --with-gcc=gcc --package-db=/build/tmp.h3zVNPavfA/package.conf.d --ghc-option=-j14 --ghc-option=+RTS --ghc-option=-A64M --ghc-option=-RTS --enable-library-profiling --profiling-detail=exported-functions --disable-profiling --enable-shared --disable-coverage --enable-static --disable-executable-dynamic --enable-tests --disable-benchmarks --enable-library-vanilla --disable-library-for-ghci --enable-split-sections --enable-library-stripping --enable-executable-stripping --ghc-option=-haddock --ghc-option=-Wall --ghc-option=-Werror --extra-lib-dirs=/nix/store/wl2nw5l4x4dg6kclbgpq7v9212i1s6cy-ncurses-6.6/lib --extra-lib-dirs=/nix/store/2zs4bbi72plfm8j6zxf1js4f3yc4yzwy-libffi-3.5.2/lib --extra-lib-dirs=/nix/store/qhmqdg27kcrlkl8ida6d5hiacw0y8d21-elfutils-0.194/lib --extra-lib-dirs=/nix/store/y56aqb1m3y5davn6hsv4jfbml78qw4mv-gmp-with-cxx-6.3.0/lib --extra-lib-dirs=/nix/store/wjfhh11sfcdf97mvg7hbxickybxzk850-numactl-2.0.18/lib
  247. 11.33 s > Using Parsec parser
  248. 11.33 s > Configuring schema-dot-org-jsonld-0.0.0.0...
  249. 11.33 s > Dependency aeson: using aeson-2.2.4.1
  250. 11.33 s > Dependency base >=4.7 && <5: using base-4.20.2.0
  251. 11.33 s > Dependency bytestring: using bytestring-0.12.2.0
  252. 11.33 s > Dependency schema-dot-org: using schema-dot-org-0.0.0.0
  253. 11.33 s > Dependency tagsoup: using tagsoup-0.14.8
  254. 11.33 s > Dependency text: using text-2.1.3
  255. 11.33 s > Dependency vector: using vector-0.13.2.0
  256. 11.33 s > Dependency aeson: using aeson-2.2.4.1
  257. 11.33 s > Dependency base >=4.7 && <5: using base-4.20.2.0
  258. 11.33 s > Dependency bytestring: using bytestring-0.12.2.0
  259. 11.33 s > Dependency path: using path-0.9.6
  260. 11.33 s > Dependency schema-dot-org-jsonld: using schema-dot-org-jsonld-0.0.0.0
  261. 11.33 s > Dependency sydtest: using sydtest-0.20.0.1
  262. 11.33 s > Dependency sydtest-aeson: using sydtest-aeson-0.2.0.1
  263. 11.33 s > Source component graph:
  264. 11.33 s > component lib
  265. 11.33 s > component test:schema-dot-org-jsonld-test dependency lib
  266. 11.33 s > Configured component graph:
  267. 11.33 s > component schema-dot-org-jsonld-0.0.0.0-IFXBqy7zHoeF7tncdo1uxB
  268. 11.33 s > include aeson-2.2.4.1-I5kgiCyiPJO8jEV0bEgUez
  269. 11.33 s > include base-4.20.2.0-4d66
  270. 11.33 s > include bytestring-0.12.2.0-25ef
  271. 11.33 s > include schema-dot-org-0.0.0.0-DK3bNdhkDmvFOAaebGqsq5
  272. 11.33 s > include tagsoup-0.14.8-BsqbPSEZh9W5mB1CzgSWho
  273. 11.33 s > include text-2.1.3-3f03
  274. 11.33 s > include vector-0.13.2.0-4sNODSde54Y5T3xVFmV0fE
  275. 11.33 s > component schema-dot-org-jsonld-0.0.0.0-Cu5ewoR91fM6pMI6cAFpDW-schema-dot-org-jsonld-test
  276. 11.33 s > include aeson-2.2.4.1-I5kgiCyiPJO8jEV0bEgUez
  277. 11.33 s > include base-4.20.2.0-4d66
  278. 11.33 s > include bytestring-0.12.2.0-25ef
  279. 11.33 s > include path-0.9.6-L3t3TcndY3P7bshtU9371n
  280. 11.33 s > include schema-dot-org-jsonld-0.0.0.0-IFXBqy7zHoeF7tncdo1uxB
  281. 11.33 s > include sydtest-0.20.0.1-Jo2KtBwwg0M2hH86LVxxcs
  282. 11.33 s > include sydtest-aeson-0.2.0.1-AEtebtKhgEIKIZK2rvdpfT
  283. 11.33 s > Linked component graph:
  284. 11.33 s > unit schema-dot-org-jsonld-0.0.0.0-IFXBqy7zHoeF7tncdo1uxB
  285. 11.33 s > include aeson-2.2.4.1-I5kgiCyiPJO8jEV0bEgUez
  286. 11.33 s > include base-4.20.2.0-4d66
  287. 11.33 s > include bytestring-0.12.2.0-25ef
  288. 11.33 s > include schema-dot-org-0.0.0.0-DK3bNdhkDmvFOAaebGqsq5
  289. 11.33 s > include tagsoup-0.14.8-BsqbPSEZh9W5mB1CzgSWho
  290. 11.33 s > include text-2.1.3-3f03
  291. 11.33 s > include vector-0.13.2.0-4sNODSde54Y5T3xVFmV0fE
  292. 11.33 s > SchemaDotOrg.JSONLD=schema-dot-org-jsonld-0.0.0.0-IFXBqy7zHoeF7tncdo1uxB:SchemaDotOrg.JSONLD,SchemaDotOrg.JSONLD.Parse=schema-dot-org-jsonld-0.0.0.0-IFXBqy7zHoeF7tncdo1uxB:SchemaDotOrg.JSONLD.Parse,SchemaDotOrg.JSONLD.Render=schema-dot-org-jsonld-0.0.0.0-IFXBqy7zHoeF7tncdo1uxB:SchemaDotOrg.JSONLD.Render,SchemaDotOrg.JSONLD.Tagsoup=schema-dot-org-jsonld-0.0.0.0-IFXBqy7zHoeF7tncdo1uxB:SchemaDotOrg.JSONLD.Tagsoup
  293. 11.33 s > unit schema-dot-org-jsonld-0.0.0.0-Cu5ewoR91fM6pMI6cAFpDW-schema-dot-org-jsonld-test
  294. 11.33 s > include aeson-2.2.4.1-I5kgiCyiPJO8jEV0bEgUez
  295. 11.33 s > include base-4.20.2.0-4d66
  296. 11.33 s > include bytestring-0.12.2.0-25ef
  297. 11.33 s > include path-0.9.6-L3t3TcndY3P7bshtU9371n
  298. 11.33 s > include schema-dot-org-jsonld-0.0.0.0-IFXBqy7zHoeF7tncdo1uxB
  299. 11.33 s > include sydtest-0.20.0.1-Jo2KtBwwg0M2hH86LVxxcs
  300. 11.33 s > include sydtest-aeson-0.2.0.1-AEtebtKhgEIKIZK2rvdpfT
  301. 11.33 s > Ready component graph:
  302. 11.33 s > definite schema-dot-org-jsonld-0.0.0.0-IFXBqy7zHoeF7tncdo1uxB
  303. 11.33 s > depends aeson-2.2.4.1-I5kgiCyiPJO8jEV0bEgUez
  304. 11.33 s > depends base-4.20.2.0-4d66
  305. 11.33 s > depends bytestring-0.12.2.0-25ef
  306. 11.33 s > depends schema-dot-org-0.0.0.0-DK3bNdhkDmvFOAaebGqsq5
  307. 11.33 s > depends tagsoup-0.14.8-BsqbPSEZh9W5mB1CzgSWho
  308. 11.33 s > depends text-2.1.3-3f03
  309. 11.33 s > depends vector-0.13.2.0-4sNODSde54Y5T3xVFmV0fE
  310. 11.33 s > definite schema-dot-org-jsonld-0.0.0.0-Cu5ewoR91fM6pMI6cAFpDW-schema-dot-org-jsonld-test
  311. 11.33 s > depends aeson-2.2.4.1-I5kgiCyiPJO8jEV0bEgUez
  312. 11.33 s > depends base-4.20.2.0-4d66
  313. 11.33 s > depends bytestring-0.12.2.0-25ef
  314. 11.33 s > depends path-0.9.6-L3t3TcndY3P7bshtU9371n
  315. 11.33 s > depends schema-dot-org-jsonld-0.0.0.0-IFXBqy7zHoeF7tncdo1uxB
  316. 11.33 s > depends sydtest-0.20.0.1-Jo2KtBwwg0M2hH86LVxxcs
  317. 11.33 s > depends sydtest-aeson-0.2.0.1-AEtebtKhgEIKIZK2rvdpfT
  318. 11.33 s > Using Cabal-3.12.1.0 compiled by ghc-9.10
  319. 11.33 s > Using compiler: ghc-9.10.3
  320. 11.33 s > Using install prefix:
  321. 11.33 s > /nix/store/8q2s09jza1l7wqhq4i0sqrkqmsx0ldiz-schema-dot-org-jsonld-0.0.0.0
  322. 11.33 s > Executables installed in:
  323. 11.33 s > /nix/store/8q2s09jza1l7wqhq4i0sqrkqmsx0ldiz-schema-dot-org-jsonld-0.0.0.0/bin
  324. 11.33 s > Libraries installed in:
  325. 11.33 s > /nix/store/8q2s09jza1l7wqhq4i0sqrkqmsx0ldiz-schema-dot-org-jsonld-0.0.0.0/lib/ghc-9.10.3/lib/x86_64-linux-ghc-9.10.3-21af/schema-dot-org-jsonld-0.0.0.0-IFXBqy7zHoeF7tncdo1uxB
  326. 11.33 s > Dynamic Libraries installed in:
  327. 11.33 s > /nix/store/8q2s09jza1l7wqhq4i0sqrkqmsx0ldiz-schema-dot-org-jsonld-0.0.0.0/lib/ghc-9.10.3/lib/x86_64-linux-ghc-9.10.3-21af
  328. 11.33 s > Private executables installed in:
  329. 11.33 s > /nix/store/8q2s09jza1l7wqhq4i0sqrkqmsx0ldiz-schema-dot-org-jsonld-0.0.0.0/libexec/x86_64-linux-ghc-9.10.3-21af/schema-dot-org-jsonld-0.0.0.0
  330. 11.33 s > Data files installed in:
  331. 11.33 s > /nix/store/8q2s09jza1l7wqhq4i0sqrkqmsx0ldiz-schema-dot-org-jsonld-0.0.0.0/share/x86_64-linux-ghc-9.10.3-21af/schema-dot-org-jsonld-0.0.0.0
  332. 11.33 s > Documentation installed in:
  333. 11.33 s > /nix/store/nicsxijpgvgpw191gz23d9r192p566w0-schema-dot-org-jsonld-0.0.0.0-doc/share/doc/schema-dot-org-jsonld-0.0.0.0
  334. 11.33 s > Configuration files installed in:
  335. 11.33 s > /nix/store/8q2s09jza1l7wqhq4i0sqrkqmsx0ldiz-schema-dot-org-jsonld-0.0.0.0/etc
  336. 11.33 s > No alex found
  337. 11.33 s > Using ar found on system at:
  338. 11.33 s > /nix/store/mbyy19mdwnfvfwmdi0gqgggx0njvpl1w-binutils-wrapper-2.46/bin/ar
  339. 11.33 s > No c2hs found
  340. 11.33 s > No cpphs found
  341. 11.33 s > No doctest found
  342. 11.33 s > Using gcc version 15.2.0 given by user at:
  343. 11.33 s > /nix/store/788mx070y81zjlg5ipcl0cra3afviw9k-gcc-wrapper-15.2.0/bin/gcc
  344. 11.33 s > Using ghc version 9.10.3 found on system at:
  345. 11.33 s > /nix/store/k493jzz83044mqayvlb6247l35780kxy-ghc-9.10.3/bin/ghc
  346. 11.33 s > Using ghc-pkg version 9.10.3 found on system at:
  347. 11.33 s > /nix/store/k493jzz83044mqayvlb6247l35780kxy-ghc-9.10.3/bin/ghc-pkg-9.10.3
  348. 11.33 s > No ghcjs found
  349. 11.33 s > No ghcjs-pkg found
  350. 11.33 s > No greencard found
  351. 11.33 s > Using haddock version 2.31.1 found on system at:
  352. 11.33 s > /nix/store/k493jzz83044mqayvlb6247l35780kxy-ghc-9.10.3/bin/haddock-ghc-9.10.3
  353. 11.33 s > No happy found
  354. 11.33 s > Using haskell-suite found on system at: haskell-suite-dummy-location
  355. 11.33 s > Using haskell-suite-pkg found on system at: haskell-suite-pkg-dummy-location
  356. 11.33 s > No hmake found
  357. 11.33 s > Using hpc version 0.69 found on system at:
  358. 11.33 s > /nix/store/k493jzz83044mqayvlb6247l35780kxy-ghc-9.10.3/bin/hpc-ghc-9.10.3
  359. 11.33 s > Using hsc2hs version 0.68.10 found on system at:
  360. 11.33 s > /nix/store/k493jzz83044mqayvlb6247l35780kxy-ghc-9.10.3/bin/hsc2hs-ghc-9.10.3
  361. 11.33 s > Using hscolour version 1.25 found on system at:
  362. 11.33 s > /nix/store/hvlf3xzdw0p5s3kybdkch6iqyz0740rc-hscolour-1.25/bin/HsColour
  363. 11.33 s > No jhc found
  364. 11.33 s > Using ld found on system at:
  365. 11.33 s > /nix/store/788mx070y81zjlg5ipcl0cra3afviw9k-gcc-wrapper-15.2.0/bin/ld
  366. 11.33 s > No pkg-config found
  367. 11.33 s > Using runghc version 9.10.3 found on system at:
  368. 11.33 s > /nix/store/k493jzz83044mqayvlb6247l35780kxy-ghc-9.10.3/bin/runghc-9.10.3
  369. 11.33 s > Using strip version 2.46 found on system at:
  370. 11.33 s > /nix/store/788mx070y81zjlg5ipcl0cra3afviw9k-gcc-wrapper-15.2.0/bin/strip
  371. 11.33 s > Using tar found on system at:
  372. 11.33 s > /nix/store/k5akwnrn9x2afaj2va7g4a2zpdim8l43-gnutar-1.35/bin/tar
  373. 11.33 s > No uhc found
  374. 11.33 s > Running phase: buildPhase
  375. 11.33 s > Preprocessing library for schema-dot-org-jsonld-0.0.0.0...
  376. 11.33 s > Building library for schema-dot-org-jsonld-0.0.0.0...
  377. 11.33 s > [1 of 5] Compiling Paths_schema_dot_org_jsonld ( dist/build/autogen/Paths_schema_dot_org_jsonld.hs, dist/build/Paths_schema_dot_org_jsonld.o, dist/build/Paths_schema_dot_org_jsonld.dyn_o )
  378. 11.33 s > [2 of 5] Compiling SchemaDotOrg.JSONLD.Parse ( src/SchemaDotOrg/JSONLD/Parse.hs, dist/build/SchemaDotOrg/JSONLD/Parse.o, dist/build/SchemaDotOrg/JSONLD/Parse.dyn_o )
  379. 11.33 s > [3 of 5] Compiling SchemaDotOrg.JSONLD.Render ( src/SchemaDotOrg/JSONLD/Render.hs, dist/build/SchemaDotOrg/JSONLD/Render.o, dist/build/SchemaDotOrg/JSONLD/Render.dyn_o )
  380. 11.33 s > [4 of 5] Compiling SchemaDotOrg.JSONLD.Tagsoup ( src/SchemaDotOrg/JSONLD/Tagsoup.hs, dist/build/SchemaDotOrg/JSONLD/Tagsoup.o, dist/build/SchemaDotOrg/JSONLD/Tagsoup.dyn_o )
  381. 11.33 s > [5 of 5] Compiling SchemaDotOrg.JSONLD ( src/SchemaDotOrg/JSONLD.hs, dist/build/SchemaDotOrg/JSONLD.o, dist/build/SchemaDotOrg/JSONLD.dyn_o )
  382. 11.33 s > [1 of 5] Compiling Paths_schema_dot_org_jsonld ( dist/build/autogen/Paths_schema_dot_org_jsonld.hs, dist/build/Paths_schema_dot_org_jsonld.p_o )
  383. 11.33 s > [2 of 5] Compiling SchemaDotOrg.JSONLD.Parse ( src/SchemaDotOrg/JSONLD/Parse.hs, dist/build/SchemaDotOrg/JSONLD/Parse.p_o )
  384. 11.33 s > [3 of 5] Compiling SchemaDotOrg.JSONLD.Render ( src/SchemaDotOrg/JSONLD/Render.hs, dist/build/SchemaDotOrg/JSONLD/Render.p_o )
  385. 11.33 s > [4 of 5] Compiling SchemaDotOrg.JSONLD.Tagsoup ( src/SchemaDotOrg/JSONLD/Tagsoup.hs, dist/build/SchemaDotOrg/JSONLD/Tagsoup.p_o )
  386. 11.33 s > [5 of 5] Compiling SchemaDotOrg.JSONLD ( src/SchemaDotOrg/JSONLD.hs, dist/build/SchemaDotOrg/JSONLD.p_o )
  387. 11.33 s > Preprocessing test suite 'schema-dot-org-jsonld-test' for schema-dot-org-jsonld-0.0.0.0...
  388. 11.33 s > Building test suite 'schema-dot-org-jsonld-test' for schema-dot-org-jsonld-0.0.0.0...
  389. 11.33 s > [1 of 3] Compiling Paths_schema_dot_org_jsonld ( dist/build/schema-dot-org-jsonld-test/autogen/Paths_schema_dot_org_jsonld.hs, dist/build/schema-dot-org-jsonld-test/schema-dot-org-jsonld-test-tmp/Paths_schema_dot_org_jsonld.o )
  390. 11.33 s > [2 of 3] Compiling SchemaDotOrg.JSONLD.TagsoupSpec ( test/SchemaDotOrg/JSONLD/TagsoupSpec.hs, dist/build/schema-dot-org-jsonld-test/schema-dot-org-jsonld-test-tmp/SchemaDotOrg/JSONLD/TagsoupSpec.o )
  391. 11.33 s > test/SchemaDotOrg/JSONLD/TagsoupSpec.hs:33:25: error: [GHC-83865]
  392. 11.33 s > • Couldn't match type: Path.Internal.Posix.Path
  393. 11.33 s > Path.Posix.Rel Path.Posix.Dir
  394. 11.33 s > with: [Char]
  395. 11.33 s > Expected: FilePath
  396. 11.33 s > Actual: Path.Internal.Posix.Path Path.Posix.Rel Path.Posix.Dir
  397. 11.33 s > • In the first argument of ‘scenarioDir’, namely
  398. 11.33 s > ‘(Path.Internal.Posix.Path "test_resources/" ::
  399. 11.33 s > Path.Internal.Posix.Path Path.Posix.Rel Path.Posix.Dir)’
  400. 11.33 s > In the first argument of ‘($)’, namely
  401. 11.33 s > ‘scenarioDir
  402. 11.33 s > (Path.Internal.Posix.Path "test_resources/" ::
  403. 11.33 s > Path.Internal.Posix.Path Path.Posix.Rel Path.Posix.Dir)’
  404. 11.33 s > In the second argument of ‘($)’, namely
  405. 11.33 s > ‘scenarioDir
  406. 11.33 s > (Path.Internal.Posix.Path "test_resources/" ::
  407. 11.33 s > Path.Internal.Posix.Path Path.Posix.Rel Path.Posix.Dir)
  408. 11.33 s > $ \ file
  409. 11.33 s > -> when (fileExtension file == Just ".html")
  410. 11.33 s > $ do let ...
  411. 11.33 s > it (unwords [...]) $ do ...’
  412. 11.33 s > |
  413. 11.33 s > 33 | scenarioDir [reldir|test_resources|] $ \file ->
  414. 11.33 s > | ^^^^^^^^^^^^^^^^
  415. 11.33 s >
  416. 11.33 s > test/SchemaDotOrg/JSONLD/TagsoupSpec.hs:34:27: error: [GHC-83865]
  417. 11.33 s > • Couldn't match type: [Char]
  418. 11.33 s > with: Path.Internal.Posix.Path b0 Path.Posix.File
  419. 11.33 s > Expected: Path.Internal.Posix.Path b0 Path.Posix.File
  420. 11.33 s > Actual: FilePath
  421. 11.33 s > • In the first argument of ‘fileExtension’, namely ‘file’
  422. 11.33 s > In the first argument of ‘(==)’, namely ‘fileExtension file’
  423. 11.33 s > In the first argument of ‘when’, namely
  424. 11.33 s > ‘(fileExtension file == Just ".html")’
  425. 11.33 s > |
  426. 11.33 s > 34 | when (fileExtension file == Just ".html") $ do
  427. 11.33 s > | ^^^^
  428. 11.33 s >
  429. 11.33 s > test/SchemaDotOrg/JSONLD/TagsoupSpec.hs:35:30: error: [GHC-83865]
  430. 11.33 s > • Couldn't match type: [Char]
  431. 11.33 s > with: Path.Internal.Posix.Path Path.Posix.Rel Path.Posix.File
  432. 11.33 s > Expected: Path.Internal.Posix.Path Path.Posix.Rel Path.Posix.File
  433. 11.33 s > Actual: FilePath
  434. 11.33 s > • In the first argument of ‘fromRelFile’, namely ‘file’
  435. 11.33 s > In the expression: fromRelFile file
  436. 11.33 s > In an equation for ‘fp’: fp = fromRelFile file
  437. 11.33 s > |
  438. 11.33 s > 35 | let fp = fromRelFile file
  439. 11.33 s > | ^^^^
  440. 11.33 s >
  441. 11.33 s For full logs, run:
  442. 11.33 s nix log /nix/store/b7wxkz1av6hmgals5h16625kcxfjpvyg-schema-dot-org-jsonld-0.0.0.0.drv
  443. 12.19 s Build failed.