build checks.x86_64-linux.jsonld

Queued Started Finished

Reproduce this run
Retry Run
  1. 0.00 s $ /nix/store/9ypz3flqsrl5xl495mm8h645gadjsxi1-coreutils-9.11/bin/timeout --kill-after=15s 7200s /nix/store/23zk8sgzamrbmj1fday15szf7f2279s8-nix-2.34.7/bin/nix --extra-experimental-features nix-command --extra-experimental-features flakes --log-format internal-json build --no-link --print-out-paths git+https://github.com/NorfairKing/schema-dot-org?ref=refs%2Fpull%2F1%2Fmerge&rev=64d6e1ea54fbc3b9846955da29886f0bfbd3f79b&shallow=1#checks.x86_64-linux.jsonld --print-build-logs
  2. 1.08 s
  3. 1.23 s Building /nix/store/b7wxkz1av6hmgals5h16625kcxfjpvyg-schema-dot-org-jsonld-0.0.0.0.drv
  4. 1.52 s [schema-dot-org-jsonld] Phase: setupCompilerEnvironmentPhase
  5. 1.53 s [schema-dot-org-jsonld] Build with /nix/store/k493jzz83044mqayvlb6247l35780kxy-ghc-9.10.3.
  6. 2.19 s [schema-dot-org-jsonld] Phase: unpackPhase
  7. 2.19 s [schema-dot-org-jsonld] unpacking source archive /nix/store/9q5dm03axrmxqhm6x7iqpyv5947n8j8l-schema-dot-org-jsonld-source-0.0.0.0/schema-dot-org-jsonld-0.0.0.0.tar.gz
  8. 2.20 s [schema-dot-org-jsonld] source root is schema-dot-org-jsonld-0.0.0.0
  9. 2.22 s [schema-dot-org-jsonld] setting SOURCE_DATE_EPOCH to timestamp 1788936908 of file "schema-dot-org-jsonld-0.0.0.0/test/Spec.hs"
  10. 2.22 s [schema-dot-org-jsonld] warning: file "schema-dot-org-jsonld-0.0.0.0/test/Spec.hs" may be generated; SOURCE_DATE_EPOCH may be non-deterministic
  11. 2.23 s [schema-dot-org-jsonld] Phase: patchPhase
  12. 2.24 s [schema-dot-org-jsonld] Phase: compileBuildDriverPhase
  13. 2.25 s [schema-dot-org-jsonld] setupCompileFlags: -package-db=/build/tmp.xiEv99fNGl/setup-package.conf.d -threaded
  14. 2.29 s [schema-dot-org-jsonld] [1 of 2] Compiling Main ( Setup.hs, /build/tmp.xiEv99fNGl/Main.o )
  15. 2.34 s [schema-dot-org-jsonld] [2 of 2] Linking Setup
  16. 3.48 s [schema-dot-org-jsonld] Phase: updateAutotoolsGnuConfigScriptsPhase
  17. 3.49 s [schema-dot-org-jsonld] Phase: configurePhase
  18. 3.50 s [schema-dot-org-jsonld] configureFlags: --verbose --prefix=/nix/store/8q2s09jza1l7wqhq4i0sqrkqmsx0ldiz-schema-dot-org-jsonld-0.0.0.0 --libdir=$prefix/lib/$compiler/lib --libsubdir=$abi/$libname --docdir=/nix/store/nicsxijpgvgpw191gz23d9r192p566w0-schema-dot-org-jsonld-0.0.0.0-doc/share/doc/schema-dot-org-jsonld-0.0.0.0 --with-gcc=gcc --package-db=/build/tmp.xiEv99fNGl/package.conf.d --ghc-option=-j14 --ghc-option=+RTS --ghc-option=-A64M --ghc-option=-RTS --enable-library-profiling --profiling-detail=exported-functions --disable-profiling --enable-shared --disable-coverage --enable-static --disable-executable-dynamic --enable-tests --disable-benchmarks --enable-library-vanilla --disable-library-for-ghci --enable-split-sections --enable-library-stripping --enable-executable-stripping --ghc-option=-haddock --ghc-option=-Wall --ghc-option=-Werror --extra-lib-dirs=/nix/store/wl2nw5l4x4dg6kclbgpq7v9212i1s6cy-ncurses-6.6/lib --extra-lib-dirs=/nix/store/2zs4bbi72plfm8j6zxf1js4f3yc4yzwy-libffi-3.5.2/lib --extra-lib-dirs=/nix/store/qhmqdg27kcrlkl8ida6d5hiacw0y8d21-elfutils-0.194/lib --extra-lib-dirs=/nix/store/y56aqb1m3y5davn6hsv4jfbml78qw4mv-gmp-with-cxx-6.3.0/lib --extra-lib-dirs=/nix/store/wjfhh11sfcdf97mvg7hbxickybxzk850-numactl-2.0.18/lib
  19. 3.51 s [schema-dot-org-jsonld] Using Parsec parser
  20. 3.51 s [schema-dot-org-jsonld] Configuring schema-dot-org-jsonld-0.0.0.0...
  21. 4.25 s [schema-dot-org-jsonld] Dependency aeson: using aeson-2.2.4.1
  22. 4.25 s [schema-dot-org-jsonld] Dependency base >=4.7 && <5: using base-4.20.2.0
  23. 4.25 s [schema-dot-org-jsonld] Dependency bytestring: using bytestring-0.12.2.0
  24. 4.25 s [schema-dot-org-jsonld] Dependency schema-dot-org: using schema-dot-org-0.0.0.0
  25. 4.25 s [schema-dot-org-jsonld] Dependency tagsoup: using tagsoup-0.14.8
  26. 4.25 s [schema-dot-org-jsonld] Dependency text: using text-2.1.3
  27. 4.25 s [schema-dot-org-jsonld] Dependency vector: using vector-0.13.2.0
  28. 4.25 s [schema-dot-org-jsonld] Dependency aeson: using aeson-2.2.4.1
  29. 4.25 s [schema-dot-org-jsonld] Dependency base >=4.7 && <5: using base-4.20.2.0
  30. 4.25 s [schema-dot-org-jsonld] Dependency bytestring: using bytestring-0.12.2.0
  31. 4.25 s [schema-dot-org-jsonld] Dependency path: using path-0.9.6
  32. 4.25 s [schema-dot-org-jsonld] Dependency schema-dot-org-jsonld: using schema-dot-org-jsonld-0.0.0.0
  33. 4.25 s [schema-dot-org-jsonld] Dependency sydtest: using sydtest-0.20.0.1
  34. 4.25 s [schema-dot-org-jsonld] Dependency sydtest-aeson: using sydtest-aeson-0.2.0.1
  35. 4.25 s [schema-dot-org-jsonld] Source component graph:
  36. 4.25 s [schema-dot-org-jsonld] component lib
  37. 4.25 s [schema-dot-org-jsonld] component test:schema-dot-org-jsonld-test dependency lib
  38. 4.25 s [schema-dot-org-jsonld] Configured component graph:
  39. 4.25 s [schema-dot-org-jsonld] component schema-dot-org-jsonld-0.0.0.0-IFXBqy7zHoeF7tncdo1uxB
  40. 4.25 s [schema-dot-org-jsonld] include aeson-2.2.4.1-I5kgiCyiPJO8jEV0bEgUez
  41. 4.25 s [schema-dot-org-jsonld] include base-4.20.2.0-4d66
  42. 4.25 s [schema-dot-org-jsonld] include bytestring-0.12.2.0-25ef
  43. 4.25 s [schema-dot-org-jsonld] include schema-dot-org-0.0.0.0-DK3bNdhkDmvFOAaebGqsq5
  44. 4.25 s [schema-dot-org-jsonld] include tagsoup-0.14.8-BsqbPSEZh9W5mB1CzgSWho
  45. 4.25 s [schema-dot-org-jsonld] include text-2.1.3-3f03
  46. 4.25 s [schema-dot-org-jsonld] include vector-0.13.2.0-4sNODSde54Y5T3xVFmV0fE
  47. 4.25 s [schema-dot-org-jsonld] component schema-dot-org-jsonld-0.0.0.0-Cu5ewoR91fM6pMI6cAFpDW-schema-dot-org-jsonld-test
  48. 4.25 s [schema-dot-org-jsonld] include aeson-2.2.4.1-I5kgiCyiPJO8jEV0bEgUez
  49. 4.25 s [schema-dot-org-jsonld] include base-4.20.2.0-4d66
  50. 4.25 s [schema-dot-org-jsonld] include bytestring-0.12.2.0-25ef
  51. 4.25 s [schema-dot-org-jsonld] include path-0.9.6-L3t3TcndY3P7bshtU9371n
  52. 4.25 s [schema-dot-org-jsonld] include schema-dot-org-jsonld-0.0.0.0-IFXBqy7zHoeF7tncdo1uxB
  53. 4.25 s [schema-dot-org-jsonld] include sydtest-0.20.0.1-Jo2KtBwwg0M2hH86LVxxcs
  54. 4.25 s [schema-dot-org-jsonld] include sydtest-aeson-0.2.0.1-AEtebtKhgEIKIZK2rvdpfT
  55. 4.25 s [schema-dot-org-jsonld] Linked component graph:
  56. 4.25 s [schema-dot-org-jsonld] unit schema-dot-org-jsonld-0.0.0.0-IFXBqy7zHoeF7tncdo1uxB
  57. 4.25 s [schema-dot-org-jsonld] include aeson-2.2.4.1-I5kgiCyiPJO8jEV0bEgUez
  58. 4.25 s [schema-dot-org-jsonld] include base-4.20.2.0-4d66
  59. 4.25 s [schema-dot-org-jsonld] include bytestring-0.12.2.0-25ef
  60. 4.25 s [schema-dot-org-jsonld] include schema-dot-org-0.0.0.0-DK3bNdhkDmvFOAaebGqsq5
  61. 4.25 s [schema-dot-org-jsonld] include tagsoup-0.14.8-BsqbPSEZh9W5mB1CzgSWho
  62. 4.25 s [schema-dot-org-jsonld] include text-2.1.3-3f03
  63. 4.25 s [schema-dot-org-jsonld] include vector-0.13.2.0-4sNODSde54Y5T3xVFmV0fE
  64. 4.25 s [schema-dot-org-jsonld] SchemaDotOrg.JSONLD=schema-dot-org-jsonld-0.0.0.0-IFXBqy7zHoeF7tncdo1uxB:SchemaDotOrg.JSONLD,SchemaDotOrg.JSONLD.Parse=schema-dot-org-jsonld-0.0.0.0-IFXBqy7zHoeF7tncdo1uxB:SchemaDotOrg.JSONLD.Parse,SchemaDotOrg.JSONLD.Render=schema-dot-org-jsonld-0.0.0.0-IFXBqy7zHoeF7tncdo1uxB:SchemaDotOrg.JSONLD.Render,SchemaDotOrg.JSONLD.Tagsoup=schema-dot-org-jsonld-0.0.0.0-IFXBqy7zHoeF7tncdo1uxB:SchemaDotOrg.JSONLD.Tagsoup
  65. 4.25 s [schema-dot-org-jsonld] unit schema-dot-org-jsonld-0.0.0.0-Cu5ewoR91fM6pMI6cAFpDW-schema-dot-org-jsonld-test
  66. 4.25 s [schema-dot-org-jsonld] include aeson-2.2.4.1-I5kgiCyiPJO8jEV0bEgUez
  67. 4.25 s [schema-dot-org-jsonld] include base-4.20.2.0-4d66
  68. 4.25 s [schema-dot-org-jsonld] include bytestring-0.12.2.0-25ef
  69. 4.25 s [schema-dot-org-jsonld] include path-0.9.6-L3t3TcndY3P7bshtU9371n
  70. 4.25 s [schema-dot-org-jsonld] include schema-dot-org-jsonld-0.0.0.0-IFXBqy7zHoeF7tncdo1uxB
  71. 4.25 s [schema-dot-org-jsonld] include sydtest-0.20.0.1-Jo2KtBwwg0M2hH86LVxxcs
  72. 4.25 s [schema-dot-org-jsonld] include sydtest-aeson-0.2.0.1-AEtebtKhgEIKIZK2rvdpfT
  73. 4.25 s [schema-dot-org-jsonld] Ready component graph:
  74. 4.25 s [schema-dot-org-jsonld] definite schema-dot-org-jsonld-0.0.0.0-IFXBqy7zHoeF7tncdo1uxB
  75. 4.25 s [schema-dot-org-jsonld] depends aeson-2.2.4.1-I5kgiCyiPJO8jEV0bEgUez
  76. 4.25 s [schema-dot-org-jsonld] depends base-4.20.2.0-4d66
  77. 4.25 s [schema-dot-org-jsonld] depends bytestring-0.12.2.0-25ef
  78. 4.25 s [schema-dot-org-jsonld] depends schema-dot-org-0.0.0.0-DK3bNdhkDmvFOAaebGqsq5
  79. 4.25 s [schema-dot-org-jsonld] depends tagsoup-0.14.8-BsqbPSEZh9W5mB1CzgSWho
  80. 4.25 s [schema-dot-org-jsonld] depends text-2.1.3-3f03
  81. 4.25 s [schema-dot-org-jsonld] depends vector-0.13.2.0-4sNODSde54Y5T3xVFmV0fE
  82. 4.25 s [schema-dot-org-jsonld] definite schema-dot-org-jsonld-0.0.0.0-Cu5ewoR91fM6pMI6cAFpDW-schema-dot-org-jsonld-test
  83. 4.25 s [schema-dot-org-jsonld] depends aeson-2.2.4.1-I5kgiCyiPJO8jEV0bEgUez
  84. 4.25 s [schema-dot-org-jsonld] depends base-4.20.2.0-4d66
  85. 4.25 s [schema-dot-org-jsonld] depends bytestring-0.12.2.0-25ef
  86. 4.25 s [schema-dot-org-jsonld] depends path-0.9.6-L3t3TcndY3P7bshtU9371n
  87. 4.25 s [schema-dot-org-jsonld] depends schema-dot-org-jsonld-0.0.0.0-IFXBqy7zHoeF7tncdo1uxB
  88. 4.25 s [schema-dot-org-jsonld] depends sydtest-0.20.0.1-Jo2KtBwwg0M2hH86LVxxcs
  89. 4.25 s [schema-dot-org-jsonld] depends sydtest-aeson-0.2.0.1-AEtebtKhgEIKIZK2rvdpfT
  90. 4.25 s [schema-dot-org-jsonld] Using Cabal-3.12.1.0 compiled by ghc-9.10
  91. 4.25 s [schema-dot-org-jsonld] Using compiler: ghc-9.10.3
  92. 4.25 s [schema-dot-org-jsonld] Using install prefix:
  93. 4.25 s [schema-dot-org-jsonld] /nix/store/8q2s09jza1l7wqhq4i0sqrkqmsx0ldiz-schema-dot-org-jsonld-0.0.0.0
  94. 4.25 s [schema-dot-org-jsonld] Executables installed in:
  95. 4.25 s [schema-dot-org-jsonld] /nix/store/8q2s09jza1l7wqhq4i0sqrkqmsx0ldiz-schema-dot-org-jsonld-0.0.0.0/bin
  96. 4.25 s [schema-dot-org-jsonld] Libraries installed in:
  97. 4.25 s [schema-dot-org-jsonld] /nix/store/8q2s09jza1l7wqhq4i0sqrkqmsx0ldiz-schema-dot-org-jsonld-0.0.0.0/lib/ghc-9.10.3/lib/x86_64-linux-ghc-9.10.3-21af/schema-dot-org-jsonld-0.0.0.0-IFXBqy7zHoeF7tncdo1uxB
  98. 4.25 s [schema-dot-org-jsonld] Dynamic Libraries installed in:
  99. 4.25 s [schema-dot-org-jsonld] /nix/store/8q2s09jza1l7wqhq4i0sqrkqmsx0ldiz-schema-dot-org-jsonld-0.0.0.0/lib/ghc-9.10.3/lib/x86_64-linux-ghc-9.10.3-21af
  100. 4.25 s [schema-dot-org-jsonld] Private executables installed in:
  101. 4.25 s [schema-dot-org-jsonld] /nix/store/8q2s09jza1l7wqhq4i0sqrkqmsx0ldiz-schema-dot-org-jsonld-0.0.0.0/libexec/x86_64-linux-ghc-9.10.3-21af/schema-dot-org-jsonld-0.0.0.0
  102. 4.25 s [schema-dot-org-jsonld] Data files installed in:
  103. 4.25 s [schema-dot-org-jsonld] /nix/store/8q2s09jza1l7wqhq4i0sqrkqmsx0ldiz-schema-dot-org-jsonld-0.0.0.0/share/x86_64-linux-ghc-9.10.3-21af/schema-dot-org-jsonld-0.0.0.0
  104. 4.25 s [schema-dot-org-jsonld] Documentation installed in:
  105. 4.25 s [schema-dot-org-jsonld] /nix/store/nicsxijpgvgpw191gz23d9r192p566w0-schema-dot-org-jsonld-0.0.0.0-doc/share/doc/schema-dot-org-jsonld-0.0.0.0
  106. 4.25 s [schema-dot-org-jsonld] Configuration files installed in:
  107. 4.25 s [schema-dot-org-jsonld] /nix/store/8q2s09jza1l7wqhq4i0sqrkqmsx0ldiz-schema-dot-org-jsonld-0.0.0.0/etc
  108. 4.25 s [schema-dot-org-jsonld] No alex found
  109. 4.25 s [schema-dot-org-jsonld] Using ar found on system at:
  110. 4.25 s [schema-dot-org-jsonld] /nix/store/mbyy19mdwnfvfwmdi0gqgggx0njvpl1w-binutils-wrapper-2.46/bin/ar
  111. 4.25 s [schema-dot-org-jsonld] No c2hs found
  112. 4.25 s [schema-dot-org-jsonld] No cpphs found
  113. 4.25 s [schema-dot-org-jsonld] No doctest found
  114. 4.25 s [schema-dot-org-jsonld] Using gcc version 15.2.0 given by user at:
  115. 4.25 s [schema-dot-org-jsonld] /nix/store/788mx070y81zjlg5ipcl0cra3afviw9k-gcc-wrapper-15.2.0/bin/gcc
  116. 4.25 s [schema-dot-org-jsonld] Using ghc version 9.10.3 found on system at:
  117. 4.25 s [schema-dot-org-jsonld] /nix/store/k493jzz83044mqayvlb6247l35780kxy-ghc-9.10.3/bin/ghc
  118. 4.25 s [schema-dot-org-jsonld] Using ghc-pkg version 9.10.3 found on system at:
  119. 4.25 s [schema-dot-org-jsonld] /nix/store/k493jzz83044mqayvlb6247l35780kxy-ghc-9.10.3/bin/ghc-pkg-9.10.3
  120. 4.25 s [schema-dot-org-jsonld] No ghcjs found
  121. 4.25 s [schema-dot-org-jsonld] No ghcjs-pkg found
  122. 4.25 s [schema-dot-org-jsonld] No greencard found
  123. 4.25 s [schema-dot-org-jsonld] Using haddock version 2.31.1 found on system at:
  124. 4.25 s [schema-dot-org-jsonld] /nix/store/k493jzz83044mqayvlb6247l35780kxy-ghc-9.10.3/bin/haddock-ghc-9.10.3
  125. 4.25 s [schema-dot-org-jsonld] No happy found
  126. 4.25 s [schema-dot-org-jsonld] Using haskell-suite found on system at: haskell-suite-dummy-location
  127. 4.25 s [schema-dot-org-jsonld] Using haskell-suite-pkg found on system at: haskell-suite-pkg-dummy-location
  128. 4.25 s [schema-dot-org-jsonld] No hmake found
  129. 4.25 s [schema-dot-org-jsonld] Using hpc version 0.69 found on system at:
  130. 4.25 s [schema-dot-org-jsonld] /nix/store/k493jzz83044mqayvlb6247l35780kxy-ghc-9.10.3/bin/hpc-ghc-9.10.3
  131. 4.25 s [schema-dot-org-jsonld] Using hsc2hs version 0.68.10 found on system at:
  132. 4.25 s [schema-dot-org-jsonld] /nix/store/k493jzz83044mqayvlb6247l35780kxy-ghc-9.10.3/bin/hsc2hs-ghc-9.10.3
  133. 4.25 s [schema-dot-org-jsonld] Using hscolour version 1.25 found on system at:
  134. 4.25 s [schema-dot-org-jsonld] /nix/store/hvlf3xzdw0p5s3kybdkch6iqyz0740rc-hscolour-1.25/bin/HsColour
  135. 4.25 s [schema-dot-org-jsonld] No jhc found
  136. 4.25 s [schema-dot-org-jsonld] Using ld found on system at:
  137. 4.25 s [schema-dot-org-jsonld] /nix/store/788mx070y81zjlg5ipcl0cra3afviw9k-gcc-wrapper-15.2.0/bin/ld
  138. 4.25 s [schema-dot-org-jsonld] No pkg-config found
  139. 4.25 s [schema-dot-org-jsonld] Using runghc version 9.10.3 found on system at:
  140. 4.25 s [schema-dot-org-jsonld] /nix/store/k493jzz83044mqayvlb6247l35780kxy-ghc-9.10.3/bin/runghc-9.10.3
  141. 4.25 s [schema-dot-org-jsonld] Using strip version 2.46 found on system at:
  142. 4.25 s [schema-dot-org-jsonld] /nix/store/788mx070y81zjlg5ipcl0cra3afviw9k-gcc-wrapper-15.2.0/bin/strip
  143. 4.25 s [schema-dot-org-jsonld] Using tar found on system at:
  144. 4.25 s [schema-dot-org-jsonld] /nix/store/k5akwnrn9x2afaj2va7g4a2zpdim8l43-gnutar-1.35/bin/tar
  145. 4.25 s [schema-dot-org-jsonld] No uhc found
  146. 5.00 s [schema-dot-org-jsonld] Phase: buildPhase
  147. 5.08 s [schema-dot-org-jsonld] Preprocessing library for schema-dot-org-jsonld-0.0.0.0...
  148. 5.08 s [schema-dot-org-jsonld] Building library for schema-dot-org-jsonld-0.0.0.0...
  149. 5.17 s [schema-dot-org-jsonld] [1 of 5] Compiling Paths_schema_dot_org_jsonld ( dist/build/autogen/Paths_schema_dot_org_jsonld.hs, dist/build/Paths_schema_dot_org_jsonld.o, dist/build/Paths_schema_dot_org_jsonld.dyn_o )
  150. 5.33 s [schema-dot-org-jsonld] [2 of 5] Compiling SchemaDotOrg.JSONLD.Parse ( src/SchemaDotOrg/JSONLD/Parse.hs, dist/build/SchemaDotOrg/JSONLD/Parse.o, dist/build/SchemaDotOrg/JSONLD/Parse.dyn_o )
  151. 5.89 s [schema-dot-org-jsonld] [3 of 5] Compiling SchemaDotOrg.JSONLD.Render ( src/SchemaDotOrg/JSONLD/Render.hs, dist/build/SchemaDotOrg/JSONLD/Render.o, dist/build/SchemaDotOrg/JSONLD/Render.dyn_o )
  152. 5.89 s [schema-dot-org-jsonld] [4 of 5] Compiling SchemaDotOrg.JSONLD.Tagsoup ( src/SchemaDotOrg/JSONLD/Tagsoup.hs, dist/build/SchemaDotOrg/JSONLD/Tagsoup.o, dist/build/SchemaDotOrg/JSONLD/Tagsoup.dyn_o )
  153. 5.99 s [schema-dot-org-jsonld] [5 of 5] Compiling SchemaDotOrg.JSONLD ( src/SchemaDotOrg/JSONLD.hs, dist/build/SchemaDotOrg/JSONLD.o, dist/build/SchemaDotOrg/JSONLD.dyn_o )
  154. 6.25 s [schema-dot-org-jsonld] [1 of 5] Compiling Paths_schema_dot_org_jsonld ( dist/build/autogen/Paths_schema_dot_org_jsonld.hs, dist/build/Paths_schema_dot_org_jsonld.p_o )
  155. 6.53 s [schema-dot-org-jsonld] [2 of 5] Compiling SchemaDotOrg.JSONLD.Parse ( src/SchemaDotOrg/JSONLD/Parse.hs, dist/build/SchemaDotOrg/JSONLD/Parse.p_o )
  156. 7.01 s [schema-dot-org-jsonld] [3 of 5] Compiling SchemaDotOrg.JSONLD.Render ( src/SchemaDotOrg/JSONLD/Render.hs, dist/build/SchemaDotOrg/JSONLD/Render.p_o )
  157. 7.01 s [schema-dot-org-jsonld] [4 of 5] Compiling SchemaDotOrg.JSONLD.Tagsoup ( src/SchemaDotOrg/JSONLD/Tagsoup.hs, dist/build/SchemaDotOrg/JSONLD/Tagsoup.p_o )
  158. 7.12 s [schema-dot-org-jsonld] [5 of 5] Compiling SchemaDotOrg.JSONLD ( src/SchemaDotOrg/JSONLD.hs, dist/build/SchemaDotOrg/JSONLD.p_o )
  159. 9.16 s [schema-dot-org-jsonld] Preprocessing test suite 'schema-dot-org-jsonld-test' for schema-dot-org-jsonld-0.0.0.0...
  160. 9.16 s [schema-dot-org-jsonld] Building test suite 'schema-dot-org-jsonld-test' for schema-dot-org-jsonld-0.0.0.0...
  161. 9.28 s [schema-dot-org-jsonld] [1 of 3] Compiling Paths_schema_dot_org_jsonld ( dist/build/schema-dot-org-jsonld-test/autogen/Paths_schema_dot_org_jsonld.hs, dist/build/schema-dot-org-jsonld-test/schema-dot-org-jsonld-test-tmp/Paths_schema_dot_org_jsonld.o )
  162. 9.38 s [schema-dot-org-jsonld] [2 of 3] Compiling SchemaDotOrg.JSONLD.TagsoupSpec ( test/SchemaDotOrg/JSONLD/TagsoupSpec.hs, dist/build/schema-dot-org-jsonld-test/schema-dot-org-jsonld-test-tmp/SchemaDotOrg/JSONLD/TagsoupSpec.o )
  163. 9.46 s [schema-dot-org-jsonld] test/SchemaDotOrg/JSONLD/TagsoupSpec.hs:33:25: error: [GHC-83865]
  164. 9.46 s [schema-dot-org-jsonld] • Couldn't match type: Path.Internal.Posix.Path
  165. 9.46 s [schema-dot-org-jsonld] Path.Posix.Rel Path.Posix.Dir
  166. 9.46 s [schema-dot-org-jsonld] with: [Char]
  167. 9.46 s [schema-dot-org-jsonld] Expected: FilePath
  168. 9.46 s [schema-dot-org-jsonld] Actual: Path.Internal.Posix.Path Path.Posix.Rel Path.Posix.Dir
  169. 9.46 s [schema-dot-org-jsonld] • In the first argument of ‘scenarioDir’, namely
  170. 9.48 s [schema-dot-org-jsonld] ‘(Path.Internal.Posix.Path "test_resources/" ::
  171. 9.48 s [schema-dot-org-jsonld] Path.Internal.Posix.Path Path.Posix.Rel Path.Posix.Dir)’
  172. 9.48 s [schema-dot-org-jsonld] In the first argument of ‘($)’, namely
  173. 9.48 s [schema-dot-org-jsonld] ‘scenarioDir
  174. 9.48 s [schema-dot-org-jsonld] (Path.Internal.Posix.Path "test_resources/" ::
  175. 9.48 s [schema-dot-org-jsonld] Path.Internal.Posix.Path Path.Posix.Rel Path.Posix.Dir)’
  176. 9.48 s [schema-dot-org-jsonld] In the second argument of ‘($)’, namely
  177. 9.48 s [schema-dot-org-jsonld] ‘scenarioDir
  178. 9.48 s [schema-dot-org-jsonld] (Path.Internal.Posix.Path "test_resources/" ::
  179. 9.48 s [schema-dot-org-jsonld] Path.Internal.Posix.Path Path.Posix.Rel Path.Posix.Dir)
  180. 9.48 s [schema-dot-org-jsonld] $ \ file
  181. 9.48 s [schema-dot-org-jsonld] -> when (fileExtension file == Just ".html")
  182. 9.48 s [schema-dot-org-jsonld] $ do let ...
  183. 9.48 s [schema-dot-org-jsonld] it (unwords [...]) $ do ...’
  184. 9.48 s [schema-dot-org-jsonld] |
  185. 9.48 s [schema-dot-org-jsonld] 33 | scenarioDir [reldir|test_resources|] $ \file ->
  186. 9.48 s [schema-dot-org-jsonld] | ^^^^^^^^^^^^^^^^
  187. 9.48 s [schema-dot-org-jsonld]
  188. 9.48 s [schema-dot-org-jsonld] test/SchemaDotOrg/JSONLD/TagsoupSpec.hs:34:27: error: [GHC-83865]
  189. 9.48 s [schema-dot-org-jsonld] • Couldn't match type: [Char]
  190. 9.48 s [schema-dot-org-jsonld] with: Path.Internal.Posix.Path b0 Path.Posix.File
  191. 9.48 s [schema-dot-org-jsonld] Expected: Path.Internal.Posix.Path b0 Path.Posix.File
  192. 9.48 s [schema-dot-org-jsonld] Actual: FilePath
  193. 9.48 s [schema-dot-org-jsonld] • In the first argument of ‘fileExtension’, namely ‘file’
  194. 9.48 s [schema-dot-org-jsonld] In the first argument of ‘(==)’, namely ‘fileExtension file’
  195. 9.48 s [schema-dot-org-jsonld] In the first argument of ‘when’, namely
  196. 9.48 s [schema-dot-org-jsonld] ‘(fileExtension file == Just ".html")’
  197. 9.48 s [schema-dot-org-jsonld] |
  198. 9.48 s [schema-dot-org-jsonld] 34 | when (fileExtension file == Just ".html") $ do
  199. 9.48 s [schema-dot-org-jsonld] | ^^^^
  200. 9.48 s [schema-dot-org-jsonld]
  201. 9.48 s [schema-dot-org-jsonld] test/SchemaDotOrg/JSONLD/TagsoupSpec.hs:35:30: error: [GHC-83865]
  202. 9.48 s [schema-dot-org-jsonld] • Couldn't match type: [Char]
  203. 9.48 s [schema-dot-org-jsonld] with: Path.Internal.Posix.Path Path.Posix.Rel Path.Posix.File
  204. 9.48 s [schema-dot-org-jsonld] Expected: Path.Internal.Posix.Path Path.Posix.Rel Path.Posix.File
  205. 9.48 s [schema-dot-org-jsonld] Actual: FilePath
  206. 9.48 s [schema-dot-org-jsonld] • In the first argument of ‘fromRelFile’, namely ‘file’
  207. 9.48 s [schema-dot-org-jsonld] In the expression: fromRelFile file
  208. 9.48 s [schema-dot-org-jsonld] In an equation for ‘fp’: fp = fromRelFile file
  209. 9.48 s [schema-dot-org-jsonld] |
  210. 9.48 s [schema-dot-org-jsonld] 35 | let fp = fromRelFile file
  211. 9.48 s [schema-dot-org-jsonld] | ^^^^
  212. 9.48 s [schema-dot-org-jsonld]
  213. 9.74 s Progress: 0 of 1 built (1 failed)
  214. 9.74 s Failed to build schema-dot-org-jsonld after 8.5s
  215. 9.75 s Cannot build '/nix/store/b7wxkz1av6hmgals5h16625kcxfjpvyg-schema-dot-org-jsonld-0.0.0.0.drv'.
  216. 9.75 s Reason: builder failed with exit code 1.
  217. 9.75 s Output paths:
  218. 9.75 s /nix/store/8q2s09jza1l7wqhq4i0sqrkqmsx0ldiz-schema-dot-org-jsonld-0.0.0.0
  219. 9.75 s /nix/store/nicsxijpgvgpw191gz23d9r192p566w0-schema-dot-org-jsonld-0.0.0.0-doc
  220. 9.75 s Last 209 log lines:
  221. 9.75 s > Running phase: setupCompilerEnvironmentPhase
  222. 9.75 s > Build with /nix/store/k493jzz83044mqayvlb6247l35780kxy-ghc-9.10.3.
  223. 9.75 s > Running phase: unpackPhase
  224. 9.75 s > unpacking source archive /nix/store/9q5dm03axrmxqhm6x7iqpyv5947n8j8l-schema-dot-org-jsonld-source-0.0.0.0/schema-dot-org-jsonld-0.0.0.0.tar.gz
  225. 9.75 s > source root is schema-dot-org-jsonld-0.0.0.0
  226. 9.75 s > setting SOURCE_DATE_EPOCH to timestamp 1788936908 of file "schema-dot-org-jsonld-0.0.0.0/test/Spec.hs"
  227. 9.75 s > warning: file "schema-dot-org-jsonld-0.0.0.0/test/Spec.hs" may be generated; SOURCE_DATE_EPOCH may be non-deterministic
  228. 9.75 s > Running phase: patchPhase
  229. 9.75 s > Running phase: compileBuildDriverPhase
  230. 9.75 s > setupCompileFlags: -package-db=/build/tmp.xiEv99fNGl/setup-package.conf.d -threaded
  231. 9.75 s > [1 of 2] Compiling Main ( Setup.hs, /build/tmp.xiEv99fNGl/Main.o )
  232. 9.75 s > [2 of 2] Linking Setup
  233. 9.75 s > Running phase: updateAutotoolsGnuConfigScriptsPhase
  234. 9.75 s > Running phase: configurePhase
  235. 9.75 s > configureFlags: --verbose --prefix=/nix/store/8q2s09jza1l7wqhq4i0sqrkqmsx0ldiz-schema-dot-org-jsonld-0.0.0.0 --libdir=$prefix/lib/$compiler/lib --libsubdir=$abi/$libname --docdir=/nix/store/nicsxijpgvgpw191gz23d9r192p566w0-schema-dot-org-jsonld-0.0.0.0-doc/share/doc/schema-dot-org-jsonld-0.0.0.0 --with-gcc=gcc --package-db=/build/tmp.xiEv99fNGl/package.conf.d --ghc-option=-j14 --ghc-option=+RTS --ghc-option=-A64M --ghc-option=-RTS --enable-library-profiling --profiling-detail=exported-functions --disable-profiling --enable-shared --disable-coverage --enable-static --disable-executable-dynamic --enable-tests --disable-benchmarks --enable-library-vanilla --disable-library-for-ghci --enable-split-sections --enable-library-stripping --enable-executable-stripping --ghc-option=-haddock --ghc-option=-Wall --ghc-option=-Werror --extra-lib-dirs=/nix/store/wl2nw5l4x4dg6kclbgpq7v9212i1s6cy-ncurses-6.6/lib --extra-lib-dirs=/nix/store/2zs4bbi72plfm8j6zxf1js4f3yc4yzwy-libffi-3.5.2/lib --extra-lib-dirs=/nix/store/qhmqdg27kcrlkl8ida6d5hiacw0y8d21-elfutils-0.194/lib --extra-lib-dirs=/nix/store/y56aqb1m3y5davn6hsv4jfbml78qw4mv-gmp-with-cxx-6.3.0/lib --extra-lib-dirs=/nix/store/wjfhh11sfcdf97mvg7hbxickybxzk850-numactl-2.0.18/lib
  236. 9.75 s > Using Parsec parser
  237. 9.75 s > Configuring schema-dot-org-jsonld-0.0.0.0...
  238. 9.75 s > Dependency aeson: using aeson-2.2.4.1
  239. 9.75 s > Dependency base >=4.7 && <5: using base-4.20.2.0
  240. 9.75 s > Dependency bytestring: using bytestring-0.12.2.0
  241. 9.75 s > Dependency schema-dot-org: using schema-dot-org-0.0.0.0
  242. 9.75 s > Dependency tagsoup: using tagsoup-0.14.8
  243. 9.75 s > Dependency text: using text-2.1.3
  244. 9.75 s > Dependency vector: using vector-0.13.2.0
  245. 9.75 s > Dependency aeson: using aeson-2.2.4.1
  246. 9.75 s > Dependency base >=4.7 && <5: using base-4.20.2.0
  247. 9.75 s > Dependency bytestring: using bytestring-0.12.2.0
  248. 9.75 s > Dependency path: using path-0.9.6
  249. 9.75 s > Dependency schema-dot-org-jsonld: using schema-dot-org-jsonld-0.0.0.0
  250. 9.75 s > Dependency sydtest: using sydtest-0.20.0.1
  251. 9.75 s > Dependency sydtest-aeson: using sydtest-aeson-0.2.0.1
  252. 9.75 s > Source component graph:
  253. 9.75 s > component lib
  254. 9.75 s > component test:schema-dot-org-jsonld-test dependency lib
  255. 9.75 s > Configured component graph:
  256. 9.75 s > component schema-dot-org-jsonld-0.0.0.0-IFXBqy7zHoeF7tncdo1uxB
  257. 9.75 s > include aeson-2.2.4.1-I5kgiCyiPJO8jEV0bEgUez
  258. 9.75 s > include base-4.20.2.0-4d66
  259. 9.75 s > include bytestring-0.12.2.0-25ef
  260. 9.75 s > include schema-dot-org-0.0.0.0-DK3bNdhkDmvFOAaebGqsq5
  261. 9.75 s > include tagsoup-0.14.8-BsqbPSEZh9W5mB1CzgSWho
  262. 9.75 s > include text-2.1.3-3f03
  263. 9.75 s > include vector-0.13.2.0-4sNODSde54Y5T3xVFmV0fE
  264. 9.75 s > component schema-dot-org-jsonld-0.0.0.0-Cu5ewoR91fM6pMI6cAFpDW-schema-dot-org-jsonld-test
  265. 9.75 s > include aeson-2.2.4.1-I5kgiCyiPJO8jEV0bEgUez
  266. 9.75 s > include base-4.20.2.0-4d66
  267. 9.75 s > include bytestring-0.12.2.0-25ef
  268. 9.75 s > include path-0.9.6-L3t3TcndY3P7bshtU9371n
  269. 9.75 s > include schema-dot-org-jsonld-0.0.0.0-IFXBqy7zHoeF7tncdo1uxB
  270. 9.75 s > include sydtest-0.20.0.1-Jo2KtBwwg0M2hH86LVxxcs
  271. 9.75 s > include sydtest-aeson-0.2.0.1-AEtebtKhgEIKIZK2rvdpfT
  272. 9.75 s > Linked component graph:
  273. 9.75 s > unit schema-dot-org-jsonld-0.0.0.0-IFXBqy7zHoeF7tncdo1uxB
  274. 9.75 s > include aeson-2.2.4.1-I5kgiCyiPJO8jEV0bEgUez
  275. 9.75 s > include base-4.20.2.0-4d66
  276. 9.75 s > include bytestring-0.12.2.0-25ef
  277. 9.75 s > include schema-dot-org-0.0.0.0-DK3bNdhkDmvFOAaebGqsq5
  278. 9.75 s > include tagsoup-0.14.8-BsqbPSEZh9W5mB1CzgSWho
  279. 9.75 s > include text-2.1.3-3f03
  280. 9.75 s > include vector-0.13.2.0-4sNODSde54Y5T3xVFmV0fE
  281. 9.75 s > SchemaDotOrg.JSONLD=schema-dot-org-jsonld-0.0.0.0-IFXBqy7zHoeF7tncdo1uxB:SchemaDotOrg.JSONLD,SchemaDotOrg.JSONLD.Parse=schema-dot-org-jsonld-0.0.0.0-IFXBqy7zHoeF7tncdo1uxB:SchemaDotOrg.JSONLD.Parse,SchemaDotOrg.JSONLD.Render=schema-dot-org-jsonld-0.0.0.0-IFXBqy7zHoeF7tncdo1uxB:SchemaDotOrg.JSONLD.Render,SchemaDotOrg.JSONLD.Tagsoup=schema-dot-org-jsonld-0.0.0.0-IFXBqy7zHoeF7tncdo1uxB:SchemaDotOrg.JSONLD.Tagsoup
  282. 9.75 s > unit schema-dot-org-jsonld-0.0.0.0-Cu5ewoR91fM6pMI6cAFpDW-schema-dot-org-jsonld-test
  283. 9.75 s > include aeson-2.2.4.1-I5kgiCyiPJO8jEV0bEgUez
  284. 9.75 s > include base-4.20.2.0-4d66
  285. 9.75 s > include bytestring-0.12.2.0-25ef
  286. 9.75 s > include path-0.9.6-L3t3TcndY3P7bshtU9371n
  287. 9.75 s > include schema-dot-org-jsonld-0.0.0.0-IFXBqy7zHoeF7tncdo1uxB
  288. 9.75 s > include sydtest-0.20.0.1-Jo2KtBwwg0M2hH86LVxxcs
  289. 9.75 s > include sydtest-aeson-0.2.0.1-AEtebtKhgEIKIZK2rvdpfT
  290. 9.75 s > Ready component graph:
  291. 9.75 s > definite schema-dot-org-jsonld-0.0.0.0-IFXBqy7zHoeF7tncdo1uxB
  292. 9.75 s > depends aeson-2.2.4.1-I5kgiCyiPJO8jEV0bEgUez
  293. 9.75 s > depends base-4.20.2.0-4d66
  294. 9.75 s > depends bytestring-0.12.2.0-25ef
  295. 9.75 s > depends schema-dot-org-0.0.0.0-DK3bNdhkDmvFOAaebGqsq5
  296. 9.75 s > depends tagsoup-0.14.8-BsqbPSEZh9W5mB1CzgSWho
  297. 9.75 s > depends text-2.1.3-3f03
  298. 9.75 s > depends vector-0.13.2.0-4sNODSde54Y5T3xVFmV0fE
  299. 9.75 s > definite schema-dot-org-jsonld-0.0.0.0-Cu5ewoR91fM6pMI6cAFpDW-schema-dot-org-jsonld-test
  300. 9.75 s > depends aeson-2.2.4.1-I5kgiCyiPJO8jEV0bEgUez
  301. 9.75 s > depends base-4.20.2.0-4d66
  302. 9.75 s > depends bytestring-0.12.2.0-25ef
  303. 9.75 s > depends path-0.9.6-L3t3TcndY3P7bshtU9371n
  304. 9.75 s > depends schema-dot-org-jsonld-0.0.0.0-IFXBqy7zHoeF7tncdo1uxB
  305. 9.75 s > depends sydtest-0.20.0.1-Jo2KtBwwg0M2hH86LVxxcs
  306. 9.75 s > depends sydtest-aeson-0.2.0.1-AEtebtKhgEIKIZK2rvdpfT
  307. 9.75 s > Using Cabal-3.12.1.0 compiled by ghc-9.10
  308. 9.75 s > Using compiler: ghc-9.10.3
  309. 9.75 s > Using install prefix:
  310. 9.75 s > /nix/store/8q2s09jza1l7wqhq4i0sqrkqmsx0ldiz-schema-dot-org-jsonld-0.0.0.0
  311. 9.75 s > Executables installed in:
  312. 9.75 s > /nix/store/8q2s09jza1l7wqhq4i0sqrkqmsx0ldiz-schema-dot-org-jsonld-0.0.0.0/bin
  313. 9.75 s > Libraries installed in:
  314. 9.75 s > /nix/store/8q2s09jza1l7wqhq4i0sqrkqmsx0ldiz-schema-dot-org-jsonld-0.0.0.0/lib/ghc-9.10.3/lib/x86_64-linux-ghc-9.10.3-21af/schema-dot-org-jsonld-0.0.0.0-IFXBqy7zHoeF7tncdo1uxB
  315. 9.75 s > Dynamic Libraries installed in:
  316. 9.75 s > /nix/store/8q2s09jza1l7wqhq4i0sqrkqmsx0ldiz-schema-dot-org-jsonld-0.0.0.0/lib/ghc-9.10.3/lib/x86_64-linux-ghc-9.10.3-21af
  317. 9.75 s > Private executables installed in:
  318. 9.75 s > /nix/store/8q2s09jza1l7wqhq4i0sqrkqmsx0ldiz-schema-dot-org-jsonld-0.0.0.0/libexec/x86_64-linux-ghc-9.10.3-21af/schema-dot-org-jsonld-0.0.0.0
  319. 9.75 s > Data files installed in:
  320. 9.75 s > /nix/store/8q2s09jza1l7wqhq4i0sqrkqmsx0ldiz-schema-dot-org-jsonld-0.0.0.0/share/x86_64-linux-ghc-9.10.3-21af/schema-dot-org-jsonld-0.0.0.0
  321. 9.75 s > Documentation installed in:
  322. 9.75 s > /nix/store/nicsxijpgvgpw191gz23d9r192p566w0-schema-dot-org-jsonld-0.0.0.0-doc/share/doc/schema-dot-org-jsonld-0.0.0.0
  323. 9.75 s > Configuration files installed in:
  324. 9.75 s > /nix/store/8q2s09jza1l7wqhq4i0sqrkqmsx0ldiz-schema-dot-org-jsonld-0.0.0.0/etc
  325. 9.75 s > No alex found
  326. 9.75 s > Using ar found on system at:
  327. 9.75 s > /nix/store/mbyy19mdwnfvfwmdi0gqgggx0njvpl1w-binutils-wrapper-2.46/bin/ar
  328. 9.75 s > No c2hs found
  329. 9.75 s > No cpphs found
  330. 9.75 s > No doctest found
  331. 9.75 s > Using gcc version 15.2.0 given by user at:
  332. 9.75 s > /nix/store/788mx070y81zjlg5ipcl0cra3afviw9k-gcc-wrapper-15.2.0/bin/gcc
  333. 9.75 s > Using ghc version 9.10.3 found on system at:
  334. 9.75 s > /nix/store/k493jzz83044mqayvlb6247l35780kxy-ghc-9.10.3/bin/ghc
  335. 9.75 s > Using ghc-pkg version 9.10.3 found on system at:
  336. 9.75 s > /nix/store/k493jzz83044mqayvlb6247l35780kxy-ghc-9.10.3/bin/ghc-pkg-9.10.3
  337. 9.75 s > No ghcjs found
  338. 9.75 s > No ghcjs-pkg found
  339. 9.75 s > No greencard found
  340. 9.75 s > Using haddock version 2.31.1 found on system at:
  341. 9.75 s > /nix/store/k493jzz83044mqayvlb6247l35780kxy-ghc-9.10.3/bin/haddock-ghc-9.10.3
  342. 9.75 s > No happy found
  343. 9.75 s > Using haskell-suite found on system at: haskell-suite-dummy-location
  344. 9.75 s > Using haskell-suite-pkg found on system at: haskell-suite-pkg-dummy-location
  345. 9.75 s > No hmake found
  346. 9.75 s > Using hpc version 0.69 found on system at:
  347. 9.75 s > /nix/store/k493jzz83044mqayvlb6247l35780kxy-ghc-9.10.3/bin/hpc-ghc-9.10.3
  348. 9.75 s > Using hsc2hs version 0.68.10 found on system at:
  349. 9.75 s > /nix/store/k493jzz83044mqayvlb6247l35780kxy-ghc-9.10.3/bin/hsc2hs-ghc-9.10.3
  350. 9.75 s > Using hscolour version 1.25 found on system at:
  351. 9.75 s > /nix/store/hvlf3xzdw0p5s3kybdkch6iqyz0740rc-hscolour-1.25/bin/HsColour
  352. 9.75 s > No jhc found
  353. 9.75 s > Using ld found on system at:
  354. 9.75 s > /nix/store/788mx070y81zjlg5ipcl0cra3afviw9k-gcc-wrapper-15.2.0/bin/ld
  355. 9.75 s > No pkg-config found
  356. 9.75 s > Using runghc version 9.10.3 found on system at:
  357. 9.75 s > /nix/store/k493jzz83044mqayvlb6247l35780kxy-ghc-9.10.3/bin/runghc-9.10.3
  358. 9.75 s > Using strip version 2.46 found on system at:
  359. 9.75 s > /nix/store/788mx070y81zjlg5ipcl0cra3afviw9k-gcc-wrapper-15.2.0/bin/strip
  360. 9.75 s > Using tar found on system at:
  361. 9.75 s > /nix/store/k5akwnrn9x2afaj2va7g4a2zpdim8l43-gnutar-1.35/bin/tar
  362. 9.75 s > No uhc found
  363. 9.75 s > Running phase: buildPhase
  364. 9.75 s > Preprocessing library for schema-dot-org-jsonld-0.0.0.0...
  365. 9.75 s > Building library for schema-dot-org-jsonld-0.0.0.0...
  366. 9.75 s > [1 of 5] Compiling Paths_schema_dot_org_jsonld ( dist/build/autogen/Paths_schema_dot_org_jsonld.hs, dist/build/Paths_schema_dot_org_jsonld.o, dist/build/Paths_schema_dot_org_jsonld.dyn_o )
  367. 9.75 s > [2 of 5] Compiling SchemaDotOrg.JSONLD.Parse ( src/SchemaDotOrg/JSONLD/Parse.hs, dist/build/SchemaDotOrg/JSONLD/Parse.o, dist/build/SchemaDotOrg/JSONLD/Parse.dyn_o )
  368. 9.75 s > [3 of 5] Compiling SchemaDotOrg.JSONLD.Render ( src/SchemaDotOrg/JSONLD/Render.hs, dist/build/SchemaDotOrg/JSONLD/Render.o, dist/build/SchemaDotOrg/JSONLD/Render.dyn_o )
  369. 9.75 s > [4 of 5] Compiling SchemaDotOrg.JSONLD.Tagsoup ( src/SchemaDotOrg/JSONLD/Tagsoup.hs, dist/build/SchemaDotOrg/JSONLD/Tagsoup.o, dist/build/SchemaDotOrg/JSONLD/Tagsoup.dyn_o )
  370. 9.75 s > [5 of 5] Compiling SchemaDotOrg.JSONLD ( src/SchemaDotOrg/JSONLD.hs, dist/build/SchemaDotOrg/JSONLD.o, dist/build/SchemaDotOrg/JSONLD.dyn_o )
  371. 9.75 s > [1 of 5] Compiling Paths_schema_dot_org_jsonld ( dist/build/autogen/Paths_schema_dot_org_jsonld.hs, dist/build/Paths_schema_dot_org_jsonld.p_o )
  372. 9.75 s > [2 of 5] Compiling SchemaDotOrg.JSONLD.Parse ( src/SchemaDotOrg/JSONLD/Parse.hs, dist/build/SchemaDotOrg/JSONLD/Parse.p_o )
  373. 9.75 s > [3 of 5] Compiling SchemaDotOrg.JSONLD.Render ( src/SchemaDotOrg/JSONLD/Render.hs, dist/build/SchemaDotOrg/JSONLD/Render.p_o )
  374. 9.75 s > [4 of 5] Compiling SchemaDotOrg.JSONLD.Tagsoup ( src/SchemaDotOrg/JSONLD/Tagsoup.hs, dist/build/SchemaDotOrg/JSONLD/Tagsoup.p_o )
  375. 9.75 s > [5 of 5] Compiling SchemaDotOrg.JSONLD ( src/SchemaDotOrg/JSONLD.hs, dist/build/SchemaDotOrg/JSONLD.p_o )
  376. 9.75 s > Preprocessing test suite 'schema-dot-org-jsonld-test' for schema-dot-org-jsonld-0.0.0.0...
  377. 9.75 s > Building test suite 'schema-dot-org-jsonld-test' for schema-dot-org-jsonld-0.0.0.0...
  378. 9.75 s > [1 of 3] Compiling Paths_schema_dot_org_jsonld ( dist/build/schema-dot-org-jsonld-test/autogen/Paths_schema_dot_org_jsonld.hs, dist/build/schema-dot-org-jsonld-test/schema-dot-org-jsonld-test-tmp/Paths_schema_dot_org_jsonld.o )
  379. 9.75 s > [2 of 3] Compiling SchemaDotOrg.JSONLD.TagsoupSpec ( test/SchemaDotOrg/JSONLD/TagsoupSpec.hs, dist/build/schema-dot-org-jsonld-test/schema-dot-org-jsonld-test-tmp/SchemaDotOrg/JSONLD/TagsoupSpec.o )
  380. 9.75 s > test/SchemaDotOrg/JSONLD/TagsoupSpec.hs:33:25: error: [GHC-83865]
  381. 9.75 s > • Couldn't match type: Path.Internal.Posix.Path
  382. 9.75 s > Path.Posix.Rel Path.Posix.Dir
  383. 9.75 s > with: [Char]
  384. 9.75 s > Expected: FilePath
  385. 9.75 s > Actual: Path.Internal.Posix.Path Path.Posix.Rel Path.Posix.Dir
  386. 9.75 s > • In the first argument of ‘scenarioDir’, namely
  387. 9.75 s > ‘(Path.Internal.Posix.Path "test_resources/" ::
  388. 9.75 s > Path.Internal.Posix.Path Path.Posix.Rel Path.Posix.Dir)’
  389. 9.75 s > In the first argument of ‘($)’, namely
  390. 9.75 s > ‘scenarioDir
  391. 9.75 s > (Path.Internal.Posix.Path "test_resources/" ::
  392. 9.75 s > Path.Internal.Posix.Path Path.Posix.Rel Path.Posix.Dir)’
  393. 9.75 s > In the second argument of ‘($)’, namely
  394. 9.75 s > ‘scenarioDir
  395. 9.75 s > (Path.Internal.Posix.Path "test_resources/" ::
  396. 9.75 s > Path.Internal.Posix.Path Path.Posix.Rel Path.Posix.Dir)
  397. 9.75 s > $ \ file
  398. 9.75 s > -> when (fileExtension file == Just ".html")
  399. 9.75 s > $ do let ...
  400. 9.75 s > it (unwords [...]) $ do ...’
  401. 9.75 s > |
  402. 9.75 s > 33 | scenarioDir [reldir|test_resources|] $ \file ->
  403. 9.75 s > | ^^^^^^^^^^^^^^^^
  404. 9.75 s >
  405. 9.75 s > test/SchemaDotOrg/JSONLD/TagsoupSpec.hs:34:27: error: [GHC-83865]
  406. 9.75 s > • Couldn't match type: [Char]
  407. 9.75 s > with: Path.Internal.Posix.Path b0 Path.Posix.File
  408. 9.75 s > Expected: Path.Internal.Posix.Path b0 Path.Posix.File
  409. 9.75 s > Actual: FilePath
  410. 9.75 s > • In the first argument of ‘fileExtension’, namely ‘file’
  411. 9.75 s > In the first argument of ‘(==)’, namely ‘fileExtension file’
  412. 9.75 s > In the first argument of ‘when’, namely
  413. 9.75 s > ‘(fileExtension file == Just ".html")’
  414. 9.75 s > |
  415. 9.75 s > 34 | when (fileExtension file == Just ".html") $ do
  416. 9.75 s > | ^^^^
  417. 9.75 s >
  418. 9.75 s > test/SchemaDotOrg/JSONLD/TagsoupSpec.hs:35:30: error: [GHC-83865]
  419. 9.75 s > • Couldn't match type: [Char]
  420. 9.75 s > with: Path.Internal.Posix.Path Path.Posix.Rel Path.Posix.File
  421. 9.75 s > Expected: Path.Internal.Posix.Path Path.Posix.Rel Path.Posix.File
  422. 9.75 s > Actual: FilePath
  423. 9.75 s > • In the first argument of ‘fromRelFile’, namely ‘file’
  424. 9.75 s > In the expression: fromRelFile file
  425. 9.75 s > In an equation for ‘fp’: fp = fromRelFile file
  426. 9.75 s > |
  427. 9.75 s > 35 | let fp = fromRelFile file
  428. 9.75 s > | ^^^^
  429. 9.75 s >
  430. 9.75 s For full logs, run:
  431. 9.75 s nix log /nix/store/b7wxkz1av6hmgals5h16625kcxfjpvyg-schema-dot-org-jsonld-0.0.0.0.drv
  432. 10.66 s Build failed.