1. 0.00 s $ /nix/store/9ypz3flqsrl5xl495mm8h645gadjsxi1-coreutils-9.11/bin/timeout --kill-after=15s 7200s /nix/store/23zk8sgzamrbmj1fday15szf7f2279s8-nix-2.34.7/bin/nix --extra-experimental-features nix-command --extra-experimental-features flakes --log-format internal-json build --no-link --print-out-paths git+https://github.com/NorfairKing/schema-dot-org?ref=refs%2Fpull%2F2%2Fmerge&rev=7cd9ef876b251e8155c34f6fc189e85a03ea6baa&shallow=1#checks.x86_64-linux.jsonld --print-build-logs
  2. 0.10 s
  3. 0.27 s Building /nix/store/xxml50x8qpinr4csm0s88q1hpaw9lj0c-schema-dot-org-jsonld-0.0.0.0.drv
  4. 0.59 s [schema-dot-org-jsonld] Phase: setupCompilerEnvironmentPhase
  5. 0.59 s [schema-dot-org-jsonld] Build with /nix/store/k493jzz83044mqayvlb6247l35780kxy-ghc-9.10.3.
  6. 1.28 s [schema-dot-org-jsonld] Phase: unpackPhase
  7. 1.28 s [schema-dot-org-jsonld] unpacking source archive /nix/store/1vv1pjq9810nsfjpdsd8vqzy9m8b1zw4-schema-dot-org-jsonld-source-0.0.0.0/schema-dot-org-jsonld-0.0.0.0.tar.gz
  8. 1.29 s [schema-dot-org-jsonld] source root is schema-dot-org-jsonld-0.0.0.0
  9. 1.30 s [schema-dot-org-jsonld] setting SOURCE_DATE_EPOCH to timestamp 1788937454 of file "schema-dot-org-jsonld-0.0.0.0/test/Spec.hs"
  10. 1.31 s [schema-dot-org-jsonld] warning: file "schema-dot-org-jsonld-0.0.0.0/test/Spec.hs" may be generated; SOURCE_DATE_EPOCH may be non-deterministic
  11. 1.32 s [schema-dot-org-jsonld] Phase: patchPhase
  12. 1.33 s [schema-dot-org-jsonld] Phase: compileBuildDriverPhase
  13. 1.33 s [schema-dot-org-jsonld] setupCompileFlags: -package-db=/build/tmp.mJAxVetjwQ/setup-package.conf.d -threaded
  14. 1.38 s [schema-dot-org-jsonld] [1 of 2] Compiling Main ( Setup.hs, /build/tmp.mJAxVetjwQ/Main.o )
  15. 1.43 s [schema-dot-org-jsonld] [2 of 2] Linking Setup
  16. 2.66 s [schema-dot-org-jsonld] Phase: updateAutotoolsGnuConfigScriptsPhase
  17. 2.68 s [schema-dot-org-jsonld] Phase: configurePhase
  18. 2.69 s [schema-dot-org-jsonld] configureFlags: --verbose --prefix=/nix/store/difjlfnxiz0pd2himiyfkf9k6y46a6w6-schema-dot-org-jsonld-0.0.0.0 --libdir=$prefix/lib/$compiler/lib --libsubdir=$abi/$libname --docdir=/nix/store/wm84bh14yg74r9cz5w7a6nhbxjc9r27b-schema-dot-org-jsonld-0.0.0.0-doc/share/doc/schema-dot-org-jsonld-0.0.0.0 --with-gcc=gcc --package-db=/build/tmp.mJAxVetjwQ/package.conf.d --ghc-option=-j14 --ghc-option=+RTS --ghc-option=-A64M --ghc-option=-RTS --enable-library-profiling --profiling-detail=exported-functions --disable-profiling --enable-shared --disable-coverage --enable-static --disable-executable-dynamic --enable-tests --disable-benchmarks --enable-library-vanilla --disable-library-for-ghci --enable-split-sections --enable-library-stripping --enable-executable-stripping --ghc-option=-haddock --ghc-option=-Wall --ghc-option=-Werror --extra-lib-dirs=/nix/store/wl2nw5l4x4dg6kclbgpq7v9212i1s6cy-ncurses-6.6/lib --extra-lib-dirs=/nix/store/2zs4bbi72plfm8j6zxf1js4f3yc4yzwy-libffi-3.5.2/lib --extra-lib-dirs=/nix/store/qhmqdg27kcrlkl8ida6d5hiacw0y8d21-elfutils-0.194/lib --extra-lib-dirs=/nix/store/y56aqb1m3y5davn6hsv4jfbml78qw4mv-gmp-with-cxx-6.3.0/lib --extra-lib-dirs=/nix/store/wjfhh11sfcdf97mvg7hbxickybxzk850-numactl-2.0.18/lib
  19. 2.70 s [schema-dot-org-jsonld] Using Parsec parser
  20. 2.70 s [schema-dot-org-jsonld] Configuring schema-dot-org-jsonld-0.0.0.0...
  21. 3.43 s [schema-dot-org-jsonld] Dependency aeson: using aeson-2.2.4.1
  22. 3.43 s [schema-dot-org-jsonld] Dependency base >=4.7 && <5: using base-4.20.2.0
  23. 3.43 s [schema-dot-org-jsonld] Dependency bytestring: using bytestring-0.12.2.0
  24. 3.43 s [schema-dot-org-jsonld] Dependency schema-dot-org: using schema-dot-org-0.0.0.0
  25. 3.43 s [schema-dot-org-jsonld] Dependency tagsoup: using tagsoup-0.14.8
  26. 3.43 s [schema-dot-org-jsonld] Dependency text: using text-2.1.3
  27. 3.43 s [schema-dot-org-jsonld] Dependency vector: using vector-0.13.2.0
  28. 3.43 s [schema-dot-org-jsonld] Dependency aeson: using aeson-2.2.4.1
  29. 3.43 s [schema-dot-org-jsonld] Dependency base >=4.7 && <5: using base-4.20.2.0
  30. 3.43 s [schema-dot-org-jsonld] Dependency bytestring: using bytestring-0.12.2.0
  31. 3.43 s [schema-dot-org-jsonld] Dependency path: using path-0.9.6
  32. 3.43 s [schema-dot-org-jsonld] Dependency schema-dot-org-jsonld: using schema-dot-org-jsonld-0.0.0.0
  33. 3.43 s [schema-dot-org-jsonld] Dependency sydtest: using sydtest-0.20.0.1
  34. 3.43 s [schema-dot-org-jsonld] Dependency sydtest-aeson: using sydtest-aeson-0.2.0.1
  35. 3.43 s [schema-dot-org-jsonld] Source component graph:
  36. 3.43 s [schema-dot-org-jsonld] component lib
  37. 3.43 s [schema-dot-org-jsonld] component test:schema-dot-org-jsonld-test dependency lib
  38. 3.43 s [schema-dot-org-jsonld] Configured component graph:
  39. 3.43 s [schema-dot-org-jsonld] component schema-dot-org-jsonld-0.0.0.0-IFXBqy7zHoeF7tncdo1uxB
  40. 3.43 s [schema-dot-org-jsonld] include aeson-2.2.4.1-I5kgiCyiPJO8jEV0bEgUez
  41. 3.43 s [schema-dot-org-jsonld] include base-4.20.2.0-4d66
  42. 3.45 s [schema-dot-org-jsonld] include bytestring-0.12.2.0-25ef
  43. 3.45 s [schema-dot-org-jsonld] include schema-dot-org-0.0.0.0-DK3bNdhkDmvFOAaebGqsq5
  44. 3.45 s [schema-dot-org-jsonld] include tagsoup-0.14.8-BsqbPSEZh9W5mB1CzgSWho
  45. 3.45 s [schema-dot-org-jsonld] include text-2.1.3-3f03
  46. 3.45 s [schema-dot-org-jsonld] include vector-0.13.2.0-4sNODSde54Y5T3xVFmV0fE
  47. 3.45 s [schema-dot-org-jsonld] component schema-dot-org-jsonld-0.0.0.0-Cu5ewoR91fM6pMI6cAFpDW-schema-dot-org-jsonld-test
  48. 3.45 s [schema-dot-org-jsonld] include aeson-2.2.4.1-I5kgiCyiPJO8jEV0bEgUez
  49. 3.45 s [schema-dot-org-jsonld] include base-4.20.2.0-4d66
  50. 3.45 s [schema-dot-org-jsonld] include bytestring-0.12.2.0-25ef
  51. 3.45 s [schema-dot-org-jsonld] include path-0.9.6-L3t3TcndY3P7bshtU9371n
  52. 3.45 s [schema-dot-org-jsonld] include schema-dot-org-jsonld-0.0.0.0-IFXBqy7zHoeF7tncdo1uxB
  53. 3.45 s [schema-dot-org-jsonld] include sydtest-0.20.0.1-Jo2KtBwwg0M2hH86LVxxcs
  54. 3.45 s [schema-dot-org-jsonld] include sydtest-aeson-0.2.0.1-AEtebtKhgEIKIZK2rvdpfT
  55. 3.45 s [schema-dot-org-jsonld] Linked component graph:
  56. 3.45 s [schema-dot-org-jsonld] unit schema-dot-org-jsonld-0.0.0.0-IFXBqy7zHoeF7tncdo1uxB
  57. 3.45 s [schema-dot-org-jsonld] include aeson-2.2.4.1-I5kgiCyiPJO8jEV0bEgUez
  58. 3.45 s [schema-dot-org-jsonld] include base-4.20.2.0-4d66
  59. 3.45 s [schema-dot-org-jsonld] include bytestring-0.12.2.0-25ef
  60. 3.45 s [schema-dot-org-jsonld] include schema-dot-org-0.0.0.0-DK3bNdhkDmvFOAaebGqsq5
  61. 3.45 s [schema-dot-org-jsonld] include tagsoup-0.14.8-BsqbPSEZh9W5mB1CzgSWho
  62. 3.45 s [schema-dot-org-jsonld] include text-2.1.3-3f03
  63. 3.45 s [schema-dot-org-jsonld] include vector-0.13.2.0-4sNODSde54Y5T3xVFmV0fE
  64. 3.45 s [schema-dot-org-jsonld] SchemaDotOrg.JSONLD=schema-dot-org-jsonld-0.0.0.0-IFXBqy7zHoeF7tncdo1uxB:SchemaDotOrg.JSONLD,SchemaDotOrg.JSONLD.Parse=schema-dot-org-jsonld-0.0.0.0-IFXBqy7zHoeF7tncdo1uxB:SchemaDotOrg.JSONLD.Parse,SchemaDotOrg.JSONLD.Render=schema-dot-org-jsonld-0.0.0.0-IFXBqy7zHoeF7tncdo1uxB:SchemaDotOrg.JSONLD.Render,SchemaDotOrg.JSONLD.Tagsoup=schema-dot-org-jsonld-0.0.0.0-IFXBqy7zHoeF7tncdo1uxB:SchemaDotOrg.JSONLD.Tagsoup
  65. 3.45 s [schema-dot-org-jsonld] unit schema-dot-org-jsonld-0.0.0.0-Cu5ewoR91fM6pMI6cAFpDW-schema-dot-org-jsonld-test
  66. 3.45 s [schema-dot-org-jsonld] include aeson-2.2.4.1-I5kgiCyiPJO8jEV0bEgUez
  67. 3.45 s [schema-dot-org-jsonld] include base-4.20.2.0-4d66
  68. 3.45 s [schema-dot-org-jsonld] include bytestring-0.12.2.0-25ef
  69. 3.45 s [schema-dot-org-jsonld] include path-0.9.6-L3t3TcndY3P7bshtU9371n
  70. 3.45 s [schema-dot-org-jsonld] include schema-dot-org-jsonld-0.0.0.0-IFXBqy7zHoeF7tncdo1uxB
  71. 3.45 s [schema-dot-org-jsonld] include sydtest-0.20.0.1-Jo2KtBwwg0M2hH86LVxxcs
  72. 3.45 s [schema-dot-org-jsonld] include sydtest-aeson-0.2.0.1-AEtebtKhgEIKIZK2rvdpfT
  73. 3.45 s [schema-dot-org-jsonld] Ready component graph:
  74. 3.45 s [schema-dot-org-jsonld] definite schema-dot-org-jsonld-0.0.0.0-IFXBqy7zHoeF7tncdo1uxB
  75. 3.45 s [schema-dot-org-jsonld] depends aeson-2.2.4.1-I5kgiCyiPJO8jEV0bEgUez
  76. 3.45 s [schema-dot-org-jsonld] depends base-4.20.2.0-4d66
  77. 3.45 s [schema-dot-org-jsonld] depends bytestring-0.12.2.0-25ef
  78. 3.45 s [schema-dot-org-jsonld] depends schema-dot-org-0.0.0.0-DK3bNdhkDmvFOAaebGqsq5
  79. 3.45 s [schema-dot-org-jsonld] depends tagsoup-0.14.8-BsqbPSEZh9W5mB1CzgSWho
  80. 3.45 s [schema-dot-org-jsonld] depends text-2.1.3-3f03
  81. 3.45 s [schema-dot-org-jsonld] depends vector-0.13.2.0-4sNODSde54Y5T3xVFmV0fE
  82. 3.45 s [schema-dot-org-jsonld] definite schema-dot-org-jsonld-0.0.0.0-Cu5ewoR91fM6pMI6cAFpDW-schema-dot-org-jsonld-test
  83. 3.45 s [schema-dot-org-jsonld] depends aeson-2.2.4.1-I5kgiCyiPJO8jEV0bEgUez
  84. 3.45 s [schema-dot-org-jsonld] depends base-4.20.2.0-4d66
  85. 3.45 s [schema-dot-org-jsonld] depends bytestring-0.12.2.0-25ef
  86. 3.45 s [schema-dot-org-jsonld] depends path-0.9.6-L3t3TcndY3P7bshtU9371n
  87. 3.45 s [schema-dot-org-jsonld] depends schema-dot-org-jsonld-0.0.0.0-IFXBqy7zHoeF7tncdo1uxB
  88. 3.45 s [schema-dot-org-jsonld] depends sydtest-0.20.0.1-Jo2KtBwwg0M2hH86LVxxcs
  89. 3.45 s [schema-dot-org-jsonld] depends sydtest-aeson-0.2.0.1-AEtebtKhgEIKIZK2rvdpfT
  90. 3.45 s [schema-dot-org-jsonld] Using Cabal-3.12.1.0 compiled by ghc-9.10
  91. 3.45 s [schema-dot-org-jsonld] Using compiler: ghc-9.10.3
  92. 3.45 s [schema-dot-org-jsonld] Using install prefix:
  93. 3.45 s [schema-dot-org-jsonld] /nix/store/difjlfnxiz0pd2himiyfkf9k6y46a6w6-schema-dot-org-jsonld-0.0.0.0
  94. 3.45 s [schema-dot-org-jsonld] Executables installed in:
  95. 3.45 s [schema-dot-org-jsonld] /nix/store/difjlfnxiz0pd2himiyfkf9k6y46a6w6-schema-dot-org-jsonld-0.0.0.0/bin
  96. 3.79 s [schema-dot-org-jsonld] Libraries installed in:
  97. 3.79 s [schema-dot-org-jsonld] /nix/store/difjlfnxiz0pd2himiyfkf9k6y46a6w6-schema-dot-org-jsonld-0.0.0.0/lib/ghc-9.10.3/lib/x86_64-linux-ghc-9.10.3-21af/schema-dot-org-jsonld-0.0.0.0-IFXBqy7zHoeF7tncdo1uxB
  98. 3.79 s [schema-dot-org-jsonld] Dynamic Libraries installed in:
  99. 3.79 s [schema-dot-org-jsonld] /nix/store/difjlfnxiz0pd2himiyfkf9k6y46a6w6-schema-dot-org-jsonld-0.0.0.0/lib/ghc-9.10.3/lib/x86_64-linux-ghc-9.10.3-21af
  100. 3.79 s [schema-dot-org-jsonld] Private executables installed in:
  101. 3.79 s [schema-dot-org-jsonld] /nix/store/difjlfnxiz0pd2himiyfkf9k6y46a6w6-schema-dot-org-jsonld-0.0.0.0/libexec/x86_64-linux-ghc-9.10.3-21af/schema-dot-org-jsonld-0.0.0.0
  102. 3.79 s [schema-dot-org-jsonld] Data files installed in:
  103. 3.79 s [schema-dot-org-jsonld] /nix/store/difjlfnxiz0pd2himiyfkf9k6y46a6w6-schema-dot-org-jsonld-0.0.0.0/share/x86_64-linux-ghc-9.10.3-21af/schema-dot-org-jsonld-0.0.0.0
  104. 3.79 s [schema-dot-org-jsonld] Documentation installed in:
  105. 3.79 s [schema-dot-org-jsonld] /nix/store/wm84bh14yg74r9cz5w7a6nhbxjc9r27b-schema-dot-org-jsonld-0.0.0.0-doc/share/doc/schema-dot-org-jsonld-0.0.0.0
  106. 3.79 s [schema-dot-org-jsonld] Configuration files installed in:
  107. 3.79 s [schema-dot-org-jsonld] /nix/store/difjlfnxiz0pd2himiyfkf9k6y46a6w6-schema-dot-org-jsonld-0.0.0.0/etc
  108. 3.79 s [schema-dot-org-jsonld] No alex found
  109. 3.79 s [schema-dot-org-jsonld] Using ar found on system at:
  110. 3.79 s [schema-dot-org-jsonld] /nix/store/mbyy19mdwnfvfwmdi0gqgggx0njvpl1w-binutils-wrapper-2.46/bin/ar
  111. 3.79 s [schema-dot-org-jsonld] No c2hs found
  112. 3.79 s [schema-dot-org-jsonld] No cpphs found
  113. 3.79 s [schema-dot-org-jsonld] No doctest found
  114. 3.79 s [schema-dot-org-jsonld] Using gcc version 15.2.0 given by user at:
  115. 3.79 s [schema-dot-org-jsonld] /nix/store/788mx070y81zjlg5ipcl0cra3afviw9k-gcc-wrapper-15.2.0/bin/gcc
  116. 3.79 s [schema-dot-org-jsonld] Using ghc version 9.10.3 found on system at:
  117. 3.79 s [schema-dot-org-jsonld] /nix/store/k493jzz83044mqayvlb6247l35780kxy-ghc-9.10.3/bin/ghc
  118. 3.79 s [schema-dot-org-jsonld] Using ghc-pkg version 9.10.3 found on system at:
  119. 3.79 s [schema-dot-org-jsonld] /nix/store/k493jzz83044mqayvlb6247l35780kxy-ghc-9.10.3/bin/ghc-pkg-9.10.3
  120. 3.79 s [schema-dot-org-jsonld] No ghcjs found
  121. 3.79 s [schema-dot-org-jsonld] No ghcjs-pkg found
  122. 3.79 s [schema-dot-org-jsonld] No greencard found
  123. 3.79 s [schema-dot-org-jsonld] Using haddock version 2.31.1 found on system at:
  124. 3.79 s [schema-dot-org-jsonld] /nix/store/k493jzz83044mqayvlb6247l35780kxy-ghc-9.10.3/bin/haddock-ghc-9.10.3
  125. 3.79 s [schema-dot-org-jsonld] No happy found
  126. 3.79 s [schema-dot-org-jsonld] Using haskell-suite found on system at: haskell-suite-dummy-location
  127. 3.79 s [schema-dot-org-jsonld] Using haskell-suite-pkg found on system at: haskell-suite-pkg-dummy-location
  128. 3.81 s [schema-dot-org-jsonld] No hmake found
  129. 3.81 s [schema-dot-org-jsonld] Using hpc version 0.69 found on system at:
  130. 3.81 s [schema-dot-org-jsonld] /nix/store/k493jzz83044mqayvlb6247l35780kxy-ghc-9.10.3/bin/hpc-ghc-9.10.3
  131. 3.81 s [schema-dot-org-jsonld] Using hsc2hs version 0.68.10 found on system at:
  132. 3.81 s [schema-dot-org-jsonld] /nix/store/k493jzz83044mqayvlb6247l35780kxy-ghc-9.10.3/bin/hsc2hs-ghc-9.10.3
  133. 3.81 s [schema-dot-org-jsonld] Using hscolour version 1.25 found on system at:
  134. 3.81 s [schema-dot-org-jsonld] /nix/store/hvlf3xzdw0p5s3kybdkch6iqyz0740rc-hscolour-1.25/bin/HsColour
  135. 3.81 s [schema-dot-org-jsonld] No jhc found
  136. 3.81 s [schema-dot-org-jsonld] Using ld found on system at:
  137. 3.81 s [schema-dot-org-jsonld] /nix/store/788mx070y81zjlg5ipcl0cra3afviw9k-gcc-wrapper-15.2.0/bin/ld
  138. 3.81 s [schema-dot-org-jsonld] No pkg-config found
  139. 3.81 s [schema-dot-org-jsonld] Using runghc version 9.10.3 found on system at:
  140. 3.81 s [schema-dot-org-jsonld] /nix/store/k493jzz83044mqayvlb6247l35780kxy-ghc-9.10.3/bin/runghc-9.10.3
  141. 3.81 s [schema-dot-org-jsonld] Using strip version 2.46 found on system at:
  142. 3.81 s [schema-dot-org-jsonld] /nix/store/788mx070y81zjlg5ipcl0cra3afviw9k-gcc-wrapper-15.2.0/bin/strip
  143. 3.81 s [schema-dot-org-jsonld] Using tar found on system at:
  144. 3.81 s [schema-dot-org-jsonld] /nix/store/k5akwnrn9x2afaj2va7g4a2zpdim8l43-gnutar-1.35/bin/tar
  145. 3.81 s [schema-dot-org-jsonld] No uhc found
  146. 4.30 s [schema-dot-org-jsonld] Phase: buildPhase
  147. 4.37 s [schema-dot-org-jsonld] Preprocessing library for schema-dot-org-jsonld-0.0.0.0...
  148. 4.38 s [schema-dot-org-jsonld] Building library for schema-dot-org-jsonld-0.0.0.0...
  149. 4.47 s [schema-dot-org-jsonld] [1 of 5] Compiling Paths_schema_dot_org_jsonld ( dist/build/autogen/Paths_schema_dot_org_jsonld.hs, dist/build/Paths_schema_dot_org_jsonld.o, dist/build/Paths_schema_dot_org_jsonld.dyn_o )
  150. 4.62 s [schema-dot-org-jsonld] [2 of 5] Compiling SchemaDotOrg.JSONLD.Parse ( src/SchemaDotOrg/JSONLD/Parse.hs, dist/build/SchemaDotOrg/JSONLD/Parse.o, dist/build/SchemaDotOrg/JSONLD/Parse.dyn_o )
  151. 5.14 s [schema-dot-org-jsonld] [3 of 5] Compiling SchemaDotOrg.JSONLD.Render ( src/SchemaDotOrg/JSONLD/Render.hs, dist/build/SchemaDotOrg/JSONLD/Render.o, dist/build/SchemaDotOrg/JSONLD/Render.dyn_o )
  152. 5.14 s [schema-dot-org-jsonld] [4 of 5] Compiling SchemaDotOrg.JSONLD.Tagsoup ( src/SchemaDotOrg/JSONLD/Tagsoup.hs, dist/build/SchemaDotOrg/JSONLD/Tagsoup.o, dist/build/SchemaDotOrg/JSONLD/Tagsoup.dyn_o )
  153. 5.25 s [schema-dot-org-jsonld] [5 of 5] Compiling SchemaDotOrg.JSONLD ( src/SchemaDotOrg/JSONLD.hs, dist/build/SchemaDotOrg/JSONLD.o, dist/build/SchemaDotOrg/JSONLD.dyn_o )
  154. 5.51 s [schema-dot-org-jsonld] [1 of 5] Compiling Paths_schema_dot_org_jsonld ( dist/build/autogen/Paths_schema_dot_org_jsonld.hs, dist/build/Paths_schema_dot_org_jsonld.p_o )
  155. 5.79 s [schema-dot-org-jsonld] [2 of 5] Compiling SchemaDotOrg.JSONLD.Parse ( src/SchemaDotOrg/JSONLD/Parse.hs, dist/build/SchemaDotOrg/JSONLD/Parse.p_o )
  156. 6.26 s [schema-dot-org-jsonld] [3 of 5] Compiling SchemaDotOrg.JSONLD.Render ( src/SchemaDotOrg/JSONLD/Render.hs, dist/build/SchemaDotOrg/JSONLD/Render.p_o )
  157. 6.26 s [schema-dot-org-jsonld] [4 of 5] Compiling SchemaDotOrg.JSONLD.Tagsoup ( src/SchemaDotOrg/JSONLD/Tagsoup.hs, dist/build/SchemaDotOrg/JSONLD/Tagsoup.p_o )
  158. 6.35 s [schema-dot-org-jsonld] [5 of 5] Compiling SchemaDotOrg.JSONLD ( src/SchemaDotOrg/JSONLD.hs, dist/build/SchemaDotOrg/JSONLD.p_o )
  159. 8.42 s [schema-dot-org-jsonld] Preprocessing test suite 'schema-dot-org-jsonld-test' for schema-dot-org-jsonld-0.0.0.0...
  160. 8.42 s [schema-dot-org-jsonld] Building test suite 'schema-dot-org-jsonld-test' for schema-dot-org-jsonld-0.0.0.0...
  161. 8.54 s [schema-dot-org-jsonld] [1 of 3] Compiling Paths_schema_dot_org_jsonld ( dist/build/schema-dot-org-jsonld-test/autogen/Paths_schema_dot_org_jsonld.hs, dist/build/schema-dot-org-jsonld-test/schema-dot-org-jsonld-test-tmp/Paths_schema_dot_org_jsonld.o )
  162. 8.63 s [schema-dot-org-jsonld] [2 of 3] Compiling SchemaDotOrg.JSONLD.TagsoupSpec ( test/SchemaDotOrg/JSONLD/TagsoupSpec.hs, dist/build/schema-dot-org-jsonld-test/schema-dot-org-jsonld-test-tmp/SchemaDotOrg/JSONLD/TagsoupSpec.o )
  163. 8.70 s [schema-dot-org-jsonld] test/SchemaDotOrg/JSONLD/TagsoupSpec.hs:34:17: error: [GHC-83865]
  164. 8.70 s [schema-dot-org-jsonld] • Couldn't match type: Path.Internal.Posix.Path
  165. 8.70 s [schema-dot-org-jsonld] Path.Posix.Rel Path.Posix.Dir
  166. 8.70 s [schema-dot-org-jsonld] with: [Char]
  167. 8.70 s [schema-dot-org-jsonld] Expected: FilePath
  168. 8.70 s [schema-dot-org-jsonld] Actual: Path.Internal.Posix.Path Path.Posix.Rel Path.Posix.Dir
  169. 8.70 s [schema-dot-org-jsonld] • In the first argument of ‘scenarioDir’, namely ‘resourcesDir’
  170. 8.70 s [schema-dot-org-jsonld] In the first argument of ‘($)’, namely ‘scenarioDir resourcesDir’
  171. 8.70 s [schema-dot-org-jsonld] In the second argument of ‘($)’, namely
  172. 8.70 s [schema-dot-org-jsonld] ‘scenarioDir resourcesDir
  173. 8.70 s [schema-dot-org-jsonld] $ \ file
  174. 8.70 s [schema-dot-org-jsonld] -> when (fileExtension file == Just ".html")
  175. 8.70 s [schema-dot-org-jsonld] $ do let ...
  176. 8.70 s [schema-dot-org-jsonld] it (unwords [...]) $ do ...’
  177. 8.70 s [schema-dot-org-jsonld] |
  178. 8.70 s [schema-dot-org-jsonld] 34 | scenarioDir resourcesDir $ \file ->
  179. 8.70 s [schema-dot-org-jsonld] | ^^^^^^^^^^^^
  180. 8.70 s [schema-dot-org-jsonld]
  181. 8.70 s [schema-dot-org-jsonld] test/SchemaDotOrg/JSONLD/TagsoupSpec.hs:35:27: error: [GHC-83865]
  182. 8.70 s [schema-dot-org-jsonld] • Couldn't match type: [Char]
  183. 8.70 s [schema-dot-org-jsonld] with: Path.Internal.Posix.Path b0 Path.Posix.File
  184. 8.70 s [schema-dot-org-jsonld] Expected: Path.Internal.Posix.Path b0 Path.Posix.File
  185. 8.70 s [schema-dot-org-jsonld] Actual: FilePath
  186. 8.70 s [schema-dot-org-jsonld] • In the first argument of ‘fileExtension’, namely ‘file’
  187. 8.70 s [schema-dot-org-jsonld] In the first argument of ‘(==)’, namely ‘fileExtension file’
  188. 8.70 s [schema-dot-org-jsonld] In the first argument of ‘when’, namely
  189. 8.70 s [schema-dot-org-jsonld] ‘(fileExtension file == Just ".html")’
  190. 8.70 s [schema-dot-org-jsonld] |
  191. 8.70 s [schema-dot-org-jsonld] 35 | when (fileExtension file == Just ".html") $ do
  192. 8.70 s [schema-dot-org-jsonld] | ^^^^
  193. 8.70 s [schema-dot-org-jsonld]
  194. 8.70 s [schema-dot-org-jsonld] test/SchemaDotOrg/JSONLD/TagsoupSpec.hs:36:48: error: [GHC-83865]
  195. 8.70 s [schema-dot-org-jsonld] • Couldn't match type: [Char]
  196. 8.70 s [schema-dot-org-jsonld] with: Path.Internal.Posix.Path Path.Posix.Rel Path.Posix.File
  197. 8.70 s [schema-dot-org-jsonld] Expected: Path.Internal.Posix.Path Path.Posix.Rel Path.Posix.File
  198. 8.70 s [schema-dot-org-jsonld] Actual: FilePath
  199. 8.70 s [schema-dot-org-jsonld] • In the second argument of ‘(</>)’, namely ‘file’
  200. 8.70 s [schema-dot-org-jsonld] In the first argument of ‘fromRelFile’, namely
  201. 8.70 s [schema-dot-org-jsonld] ‘(resourcesDir </> file)’
  202. 8.70 s [schema-dot-org-jsonld] In the expression: fromRelFile (resourcesDir </> file)
  203. 8.70 s [schema-dot-org-jsonld] |
  204. 8.70 s [schema-dot-org-jsonld] 36 | let fp = fromRelFile (resourcesDir </> file)
  205. 8.70 s [schema-dot-org-jsonld] | ^^^^
  206. 8.70 s [schema-dot-org-jsonld]
  207. 8.93 s Progress: 0 of 1 built (1 failed)
  208. 8.93 s Failed to build schema-dot-org-jsonld after 8.6s
  209. 8.94 s Cannot build '/nix/store/xxml50x8qpinr4csm0s88q1hpaw9lj0c-schema-dot-org-jsonld-0.0.0.0.drv'.
  210. 8.94 s Reason: builder failed with exit code 1.
  211. 8.94 s Output paths:
  212. 8.94 s /nix/store/difjlfnxiz0pd2himiyfkf9k6y46a6w6-schema-dot-org-jsonld-0.0.0.0
  213. 8.94 s /nix/store/wm84bh14yg74r9cz5w7a6nhbxjc9r27b-schema-dot-org-jsonld-0.0.0.0-doc
  214. 8.94 s Last 203 log lines:
  215. 8.94 s > Running phase: setupCompilerEnvironmentPhase
  216. 8.94 s > Build with /nix/store/k493jzz83044mqayvlb6247l35780kxy-ghc-9.10.3.
  217. 8.94 s > Running phase: unpackPhase
  218. 8.94 s > unpacking source archive /nix/store/1vv1pjq9810nsfjpdsd8vqzy9m8b1zw4-schema-dot-org-jsonld-source-0.0.0.0/schema-dot-org-jsonld-0.0.0.0.tar.gz
  219. 8.94 s > source root is schema-dot-org-jsonld-0.0.0.0
  220. 8.94 s > setting SOURCE_DATE_EPOCH to timestamp 1788937454 of file "schema-dot-org-jsonld-0.0.0.0/test/Spec.hs"
  221. 8.94 s > warning: file "schema-dot-org-jsonld-0.0.0.0/test/Spec.hs" may be generated; SOURCE_DATE_EPOCH may be non-deterministic
  222. 8.94 s > Running phase: patchPhase
  223. 8.94 s > Running phase: compileBuildDriverPhase
  224. 8.94 s > setupCompileFlags: -package-db=/build/tmp.mJAxVetjwQ/setup-package.conf.d -threaded
  225. 8.94 s > [1 of 2] Compiling Main ( Setup.hs, /build/tmp.mJAxVetjwQ/Main.o )
  226. 8.94 s > [2 of 2] Linking Setup
  227. 8.94 s > Running phase: updateAutotoolsGnuConfigScriptsPhase
  228. 8.94 s > Running phase: configurePhase
  229. 8.94 s > configureFlags: --verbose --prefix=/nix/store/difjlfnxiz0pd2himiyfkf9k6y46a6w6-schema-dot-org-jsonld-0.0.0.0 --libdir=$prefix/lib/$compiler/lib --libsubdir=$abi/$libname --docdir=/nix/store/wm84bh14yg74r9cz5w7a6nhbxjc9r27b-schema-dot-org-jsonld-0.0.0.0-doc/share/doc/schema-dot-org-jsonld-0.0.0.0 --with-gcc=gcc --package-db=/build/tmp.mJAxVetjwQ/package.conf.d --ghc-option=-j14 --ghc-option=+RTS --ghc-option=-A64M --ghc-option=-RTS --enable-library-profiling --profiling-detail=exported-functions --disable-profiling --enable-shared --disable-coverage --enable-static --disable-executable-dynamic --enable-tests --disable-benchmarks --enable-library-vanilla --disable-library-for-ghci --enable-split-sections --enable-library-stripping --enable-executable-stripping --ghc-option=-haddock --ghc-option=-Wall --ghc-option=-Werror --extra-lib-dirs=/nix/store/wl2nw5l4x4dg6kclbgpq7v9212i1s6cy-ncurses-6.6/lib --extra-lib-dirs=/nix/store/2zs4bbi72plfm8j6zxf1js4f3yc4yzwy-libffi-3.5.2/lib --extra-lib-dirs=/nix/store/qhmqdg27kcrlkl8ida6d5hiacw0y8d21-elfutils-0.194/lib --extra-lib-dirs=/nix/store/y56aqb1m3y5davn6hsv4jfbml78qw4mv-gmp-with-cxx-6.3.0/lib --extra-lib-dirs=/nix/store/wjfhh11sfcdf97mvg7hbxickybxzk850-numactl-2.0.18/lib
  230. 8.94 s > Using Parsec parser
  231. 8.94 s > Configuring schema-dot-org-jsonld-0.0.0.0...
  232. 8.94 s > Dependency aeson: using aeson-2.2.4.1
  233. 8.94 s > Dependency base >=4.7 && <5: using base-4.20.2.0
  234. 8.94 s > Dependency bytestring: using bytestring-0.12.2.0
  235. 8.94 s > Dependency schema-dot-org: using schema-dot-org-0.0.0.0
  236. 8.94 s > Dependency tagsoup: using tagsoup-0.14.8
  237. 8.94 s > Dependency text: using text-2.1.3
  238. 8.94 s > Dependency vector: using vector-0.13.2.0
  239. 8.94 s > Dependency aeson: using aeson-2.2.4.1
  240. 8.94 s > Dependency base >=4.7 && <5: using base-4.20.2.0
  241. 8.94 s > Dependency bytestring: using bytestring-0.12.2.0
  242. 8.94 s > Dependency path: using path-0.9.6
  243. 8.94 s > Dependency schema-dot-org-jsonld: using schema-dot-org-jsonld-0.0.0.0
  244. 8.94 s > Dependency sydtest: using sydtest-0.20.0.1
  245. 8.94 s > Dependency sydtest-aeson: using sydtest-aeson-0.2.0.1
  246. 8.94 s > Source component graph:
  247. 8.94 s > component lib
  248. 8.94 s > component test:schema-dot-org-jsonld-test dependency lib
  249. 8.94 s > Configured component graph:
  250. 8.94 s > component schema-dot-org-jsonld-0.0.0.0-IFXBqy7zHoeF7tncdo1uxB
  251. 8.94 s > include aeson-2.2.4.1-I5kgiCyiPJO8jEV0bEgUez
  252. 8.94 s > include base-4.20.2.0-4d66
  253. 8.94 s > include bytestring-0.12.2.0-25ef
  254. 8.94 s > include schema-dot-org-0.0.0.0-DK3bNdhkDmvFOAaebGqsq5
  255. 8.94 s > include tagsoup-0.14.8-BsqbPSEZh9W5mB1CzgSWho
  256. 8.94 s > include text-2.1.3-3f03
  257. 8.94 s > include vector-0.13.2.0-4sNODSde54Y5T3xVFmV0fE
  258. 8.94 s > component schema-dot-org-jsonld-0.0.0.0-Cu5ewoR91fM6pMI6cAFpDW-schema-dot-org-jsonld-test
  259. 8.94 s > include aeson-2.2.4.1-I5kgiCyiPJO8jEV0bEgUez
  260. 8.94 s > include base-4.20.2.0-4d66
  261. 8.94 s > include bytestring-0.12.2.0-25ef
  262. 8.94 s > include path-0.9.6-L3t3TcndY3P7bshtU9371n
  263. 8.94 s > include schema-dot-org-jsonld-0.0.0.0-IFXBqy7zHoeF7tncdo1uxB
  264. 8.94 s > include sydtest-0.20.0.1-Jo2KtBwwg0M2hH86LVxxcs
  265. 8.94 s > include sydtest-aeson-0.2.0.1-AEtebtKhgEIKIZK2rvdpfT
  266. 8.94 s > Linked component graph:
  267. 8.94 s > unit schema-dot-org-jsonld-0.0.0.0-IFXBqy7zHoeF7tncdo1uxB
  268. 8.94 s > include aeson-2.2.4.1-I5kgiCyiPJO8jEV0bEgUez
  269. 8.94 s > include base-4.20.2.0-4d66
  270. 8.94 s > include bytestring-0.12.2.0-25ef
  271. 8.94 s > include schema-dot-org-0.0.0.0-DK3bNdhkDmvFOAaebGqsq5
  272. 8.94 s > include tagsoup-0.14.8-BsqbPSEZh9W5mB1CzgSWho
  273. 8.94 s > include text-2.1.3-3f03
  274. 8.94 s > include vector-0.13.2.0-4sNODSde54Y5T3xVFmV0fE
  275. 8.94 s > SchemaDotOrg.JSONLD=schema-dot-org-jsonld-0.0.0.0-IFXBqy7zHoeF7tncdo1uxB:SchemaDotOrg.JSONLD,SchemaDotOrg.JSONLD.Parse=schema-dot-org-jsonld-0.0.0.0-IFXBqy7zHoeF7tncdo1uxB:SchemaDotOrg.JSONLD.Parse,SchemaDotOrg.JSONLD.Render=schema-dot-org-jsonld-0.0.0.0-IFXBqy7zHoeF7tncdo1uxB:SchemaDotOrg.JSONLD.Render,SchemaDotOrg.JSONLD.Tagsoup=schema-dot-org-jsonld-0.0.0.0-IFXBqy7zHoeF7tncdo1uxB:SchemaDotOrg.JSONLD.Tagsoup
  276. 8.94 s > unit schema-dot-org-jsonld-0.0.0.0-Cu5ewoR91fM6pMI6cAFpDW-schema-dot-org-jsonld-test
  277. 8.94 s > include aeson-2.2.4.1-I5kgiCyiPJO8jEV0bEgUez
  278. 8.94 s > include base-4.20.2.0-4d66
  279. 8.94 s > include bytestring-0.12.2.0-25ef
  280. 8.94 s > include path-0.9.6-L3t3TcndY3P7bshtU9371n
  281. 8.94 s > include schema-dot-org-jsonld-0.0.0.0-IFXBqy7zHoeF7tncdo1uxB
  282. 8.94 s > include sydtest-0.20.0.1-Jo2KtBwwg0M2hH86LVxxcs
  283. 8.94 s > include sydtest-aeson-0.2.0.1-AEtebtKhgEIKIZK2rvdpfT
  284. 8.94 s > Ready component graph:
  285. 8.94 s > definite schema-dot-org-jsonld-0.0.0.0-IFXBqy7zHoeF7tncdo1uxB
  286. 8.94 s > depends aeson-2.2.4.1-I5kgiCyiPJO8jEV0bEgUez
  287. 8.94 s > depends base-4.20.2.0-4d66
  288. 8.94 s > depends bytestring-0.12.2.0-25ef
  289. 8.94 s > depends schema-dot-org-0.0.0.0-DK3bNdhkDmvFOAaebGqsq5
  290. 8.94 s > depends tagsoup-0.14.8-BsqbPSEZh9W5mB1CzgSWho
  291. 8.94 s > depends text-2.1.3-3f03
  292. 8.94 s > depends vector-0.13.2.0-4sNODSde54Y5T3xVFmV0fE
  293. 8.94 s > definite schema-dot-org-jsonld-0.0.0.0-Cu5ewoR91fM6pMI6cAFpDW-schema-dot-org-jsonld-test
  294. 8.94 s > depends aeson-2.2.4.1-I5kgiCyiPJO8jEV0bEgUez
  295. 8.94 s > depends base-4.20.2.0-4d66
  296. 8.94 s > depends bytestring-0.12.2.0-25ef
  297. 8.94 s > depends path-0.9.6-L3t3TcndY3P7bshtU9371n
  298. 8.94 s > depends schema-dot-org-jsonld-0.0.0.0-IFXBqy7zHoeF7tncdo1uxB
  299. 8.94 s > depends sydtest-0.20.0.1-Jo2KtBwwg0M2hH86LVxxcs
  300. 8.94 s > depends sydtest-aeson-0.2.0.1-AEtebtKhgEIKIZK2rvdpfT
  301. 8.94 s > Using Cabal-3.12.1.0 compiled by ghc-9.10
  302. 8.94 s > Using compiler: ghc-9.10.3
  303. 8.94 s > Using install prefix:
  304. 8.94 s > /nix/store/difjlfnxiz0pd2himiyfkf9k6y46a6w6-schema-dot-org-jsonld-0.0.0.0
  305. 8.94 s > Executables installed in:
  306. 8.94 s > /nix/store/difjlfnxiz0pd2himiyfkf9k6y46a6w6-schema-dot-org-jsonld-0.0.0.0/bin
  307. 8.94 s > Libraries installed in:
  308. 8.94 s > /nix/store/difjlfnxiz0pd2himiyfkf9k6y46a6w6-schema-dot-org-jsonld-0.0.0.0/lib/ghc-9.10.3/lib/x86_64-linux-ghc-9.10.3-21af/schema-dot-org-jsonld-0.0.0.0-IFXBqy7zHoeF7tncdo1uxB
  309. 8.94 s > Dynamic Libraries installed in:
  310. 8.94 s > /nix/store/difjlfnxiz0pd2himiyfkf9k6y46a6w6-schema-dot-org-jsonld-0.0.0.0/lib/ghc-9.10.3/lib/x86_64-linux-ghc-9.10.3-21af
  311. 8.94 s > Private executables installed in:
  312. 8.94 s > /nix/store/difjlfnxiz0pd2himiyfkf9k6y46a6w6-schema-dot-org-jsonld-0.0.0.0/libexec/x86_64-linux-ghc-9.10.3-21af/schema-dot-org-jsonld-0.0.0.0
  313. 8.94 s > Data files installed in:
  314. 8.94 s > /nix/store/difjlfnxiz0pd2himiyfkf9k6y46a6w6-schema-dot-org-jsonld-0.0.0.0/share/x86_64-linux-ghc-9.10.3-21af/schema-dot-org-jsonld-0.0.0.0
  315. 8.94 s > Documentation installed in:
  316. 8.94 s > /nix/store/wm84bh14yg74r9cz5w7a6nhbxjc9r27b-schema-dot-org-jsonld-0.0.0.0-doc/share/doc/schema-dot-org-jsonld-0.0.0.0
  317. 8.94 s > Configuration files installed in:
  318. 8.94 s > /nix/store/difjlfnxiz0pd2himiyfkf9k6y46a6w6-schema-dot-org-jsonld-0.0.0.0/etc
  319. 8.94 s > No alex found
  320. 8.94 s > Using ar found on system at:
  321. 8.94 s > /nix/store/mbyy19mdwnfvfwmdi0gqgggx0njvpl1w-binutils-wrapper-2.46/bin/ar
  322. 8.94 s > No c2hs found
  323. 8.94 s > No cpphs found
  324. 8.94 s > No doctest found
  325. 8.94 s > Using gcc version 15.2.0 given by user at:
  326. 8.94 s > /nix/store/788mx070y81zjlg5ipcl0cra3afviw9k-gcc-wrapper-15.2.0/bin/gcc
  327. 8.94 s > Using ghc version 9.10.3 found on system at:
  328. 8.94 s > /nix/store/k493jzz83044mqayvlb6247l35780kxy-ghc-9.10.3/bin/ghc
  329. 8.94 s > Using ghc-pkg version 9.10.3 found on system at:
  330. 8.94 s > /nix/store/k493jzz83044mqayvlb6247l35780kxy-ghc-9.10.3/bin/ghc-pkg-9.10.3
  331. 8.94 s > No ghcjs found
  332. 8.94 s > No ghcjs-pkg found
  333. 8.94 s > No greencard found
  334. 8.94 s > Using haddock version 2.31.1 found on system at:
  335. 8.94 s > /nix/store/k493jzz83044mqayvlb6247l35780kxy-ghc-9.10.3/bin/haddock-ghc-9.10.3
  336. 8.94 s > No happy found
  337. 8.94 s > Using haskell-suite found on system at: haskell-suite-dummy-location
  338. 8.94 s > Using haskell-suite-pkg found on system at: haskell-suite-pkg-dummy-location
  339. 8.94 s > No hmake found
  340. 8.94 s > Using hpc version 0.69 found on system at:
  341. 8.94 s > /nix/store/k493jzz83044mqayvlb6247l35780kxy-ghc-9.10.3/bin/hpc-ghc-9.10.3
  342. 8.94 s > Using hsc2hs version 0.68.10 found on system at:
  343. 8.94 s > /nix/store/k493jzz83044mqayvlb6247l35780kxy-ghc-9.10.3/bin/hsc2hs-ghc-9.10.3
  344. 8.94 s > Using hscolour version 1.25 found on system at:
  345. 8.94 s > /nix/store/hvlf3xzdw0p5s3kybdkch6iqyz0740rc-hscolour-1.25/bin/HsColour
  346. 8.94 s > No jhc found
  347. 8.94 s > Using ld found on system at:
  348. 8.94 s > /nix/store/788mx070y81zjlg5ipcl0cra3afviw9k-gcc-wrapper-15.2.0/bin/ld
  349. 8.94 s > No pkg-config found
  350. 8.94 s > Using runghc version 9.10.3 found on system at:
  351. 8.94 s > /nix/store/k493jzz83044mqayvlb6247l35780kxy-ghc-9.10.3/bin/runghc-9.10.3
  352. 8.94 s > Using strip version 2.46 found on system at:
  353. 8.94 s > /nix/store/788mx070y81zjlg5ipcl0cra3afviw9k-gcc-wrapper-15.2.0/bin/strip
  354. 8.94 s > Using tar found on system at:
  355. 8.94 s > /nix/store/k5akwnrn9x2afaj2va7g4a2zpdim8l43-gnutar-1.35/bin/tar
  356. 8.94 s > No uhc found
  357. 8.94 s > Running phase: buildPhase
  358. 8.94 s > Preprocessing library for schema-dot-org-jsonld-0.0.0.0...
  359. 8.94 s > Building library for schema-dot-org-jsonld-0.0.0.0...
  360. 8.94 s > [1 of 5] Compiling Paths_schema_dot_org_jsonld ( dist/build/autogen/Paths_schema_dot_org_jsonld.hs, dist/build/Paths_schema_dot_org_jsonld.o, dist/build/Paths_schema_dot_org_jsonld.dyn_o )
  361. 8.94 s > [2 of 5] Compiling SchemaDotOrg.JSONLD.Parse ( src/SchemaDotOrg/JSONLD/Parse.hs, dist/build/SchemaDotOrg/JSONLD/Parse.o, dist/build/SchemaDotOrg/JSONLD/Parse.dyn_o )
  362. 8.94 s > [3 of 5] Compiling SchemaDotOrg.JSONLD.Render ( src/SchemaDotOrg/JSONLD/Render.hs, dist/build/SchemaDotOrg/JSONLD/Render.o, dist/build/SchemaDotOrg/JSONLD/Render.dyn_o )
  363. 8.94 s > [4 of 5] Compiling SchemaDotOrg.JSONLD.Tagsoup ( src/SchemaDotOrg/JSONLD/Tagsoup.hs, dist/build/SchemaDotOrg/JSONLD/Tagsoup.o, dist/build/SchemaDotOrg/JSONLD/Tagsoup.dyn_o )
  364. 8.94 s > [5 of 5] Compiling SchemaDotOrg.JSONLD ( src/SchemaDotOrg/JSONLD.hs, dist/build/SchemaDotOrg/JSONLD.o, dist/build/SchemaDotOrg/JSONLD.dyn_o )
  365. 8.94 s > [1 of 5] Compiling Paths_schema_dot_org_jsonld ( dist/build/autogen/Paths_schema_dot_org_jsonld.hs, dist/build/Paths_schema_dot_org_jsonld.p_o )
  366. 8.94 s > [2 of 5] Compiling SchemaDotOrg.JSONLD.Parse ( src/SchemaDotOrg/JSONLD/Parse.hs, dist/build/SchemaDotOrg/JSONLD/Parse.p_o )
  367. 8.94 s > [3 of 5] Compiling SchemaDotOrg.JSONLD.Render ( src/SchemaDotOrg/JSONLD/Render.hs, dist/build/SchemaDotOrg/JSONLD/Render.p_o )
  368. 8.94 s > [4 of 5] Compiling SchemaDotOrg.JSONLD.Tagsoup ( src/SchemaDotOrg/JSONLD/Tagsoup.hs, dist/build/SchemaDotOrg/JSONLD/Tagsoup.p_o )
  369. 8.94 s > [5 of 5] Compiling SchemaDotOrg.JSONLD ( src/SchemaDotOrg/JSONLD.hs, dist/build/SchemaDotOrg/JSONLD.p_o )
  370. 8.94 s > Preprocessing test suite 'schema-dot-org-jsonld-test' for schema-dot-org-jsonld-0.0.0.0...
  371. 8.94 s > Building test suite 'schema-dot-org-jsonld-test' for schema-dot-org-jsonld-0.0.0.0...
  372. 8.94 s > [1 of 3] Compiling Paths_schema_dot_org_jsonld ( dist/build/schema-dot-org-jsonld-test/autogen/Paths_schema_dot_org_jsonld.hs, dist/build/schema-dot-org-jsonld-test/schema-dot-org-jsonld-test-tmp/Paths_schema_dot_org_jsonld.o )
  373. 8.94 s > [2 of 3] Compiling SchemaDotOrg.JSONLD.TagsoupSpec ( test/SchemaDotOrg/JSONLD/TagsoupSpec.hs, dist/build/schema-dot-org-jsonld-test/schema-dot-org-jsonld-test-tmp/SchemaDotOrg/JSONLD/TagsoupSpec.o )
  374. 8.94 s > test/SchemaDotOrg/JSONLD/TagsoupSpec.hs:34:17: error: [GHC-83865]
  375. 8.94 s > • Couldn't match type: Path.Internal.Posix.Path
  376. 8.94 s > Path.Posix.Rel Path.Posix.Dir
  377. 8.94 s > with: [Char]
  378. 8.94 s > Expected: FilePath
  379. 8.94 s > Actual: Path.Internal.Posix.Path Path.Posix.Rel Path.Posix.Dir
  380. 8.94 s > • In the first argument of ‘scenarioDir’, namely ‘resourcesDir’
  381. 8.94 s > In the first argument of ‘($)’, namely ‘scenarioDir resourcesDir’
  382. 8.94 s > In the second argument of ‘($)’, namely
  383. 8.94 s > ‘scenarioDir resourcesDir
  384. 8.94 s > $ \ file
  385. 8.94 s > -> when (fileExtension file == Just ".html")
  386. 8.94 s > $ do let ...
  387. 8.94 s > it (unwords [...]) $ do ...’
  388. 8.94 s > |
  389. 8.94 s > 34 | scenarioDir resourcesDir $ \file ->
  390. 8.94 s > | ^^^^^^^^^^^^
  391. 8.94 s >
  392. 8.94 s > test/SchemaDotOrg/JSONLD/TagsoupSpec.hs:35:27: error: [GHC-83865]
  393. 8.94 s > • Couldn't match type: [Char]
  394. 8.94 s > with: Path.Internal.Posix.Path b0 Path.Posix.File
  395. 8.94 s > Expected: Path.Internal.Posix.Path b0 Path.Posix.File
  396. 8.94 s > Actual: FilePath
  397. 8.94 s > • In the first argument of ‘fileExtension’, namely ‘file’
  398. 8.94 s > In the first argument of ‘(==)’, namely ‘fileExtension file’
  399. 8.94 s > In the first argument of ‘when’, namely
  400. 8.94 s > ‘(fileExtension file == Just ".html")’
  401. 8.94 s > |
  402. 8.94 s > 35 | when (fileExtension file == Just ".html") $ do
  403. 8.94 s > | ^^^^
  404. 8.94 s >
  405. 8.94 s > test/SchemaDotOrg/JSONLD/TagsoupSpec.hs:36:48: error: [GHC-83865]
  406. 8.94 s > • Couldn't match type: [Char]
  407. 8.94 s > with: Path.Internal.Posix.Path Path.Posix.Rel Path.Posix.File
  408. 8.94 s > Expected: Path.Internal.Posix.Path Path.Posix.Rel Path.Posix.File
  409. 8.94 s > Actual: FilePath
  410. 8.94 s > • In the second argument of ‘(</>)’, namely ‘file’
  411. 8.94 s > In the first argument of ‘fromRelFile’, namely
  412. 8.94 s > ‘(resourcesDir </> file)’
  413. 8.94 s > In the expression: fromRelFile (resourcesDir </> file)
  414. 8.94 s > |
  415. 8.94 s > 36 | let fp = fromRelFile (resourcesDir </> file)
  416. 8.94 s > | ^^^^
  417. 8.94 s >
  418. 8.94 s For full logs, run:
  419. 8.94 s nix log /nix/store/xxml50x8qpinr4csm0s88q1hpaw9lj0c-schema-dot-org-jsonld-0.0.0.0.drv
  420. 9.76 s Build failed.