0.00 s
$ /nix/store/9ypz3flqsrl5xl495mm8h645gadjsxi1-coreutils-9.11/bin/timeout --kill-after=15s 7200s /nix/store/23zk8sgzamrbmj1fday15szf7f2279s8-nix-2.34.7/bin/nix --extra-experimental-features nix-command --extra-experimental-features flakes --log-format internal-json build --no-link --print-out-paths git+https://github.com/NorfairKing/schema-dot-org?ref=scenario-dir-relative-to-dir&rev=2d01e2367e3086484c0ae261424826272b989803&shallow=1#packages.x86_64-linux.jsonld --print-build-logs
1.20 s
1.72 s
Building /nix/store/dx2kwq0b24h76xi98lnzh6djc9q1dlbc-schema-dot-org-jsonld-source-0.0.0.0.drv
2.04 s
[schema-dot-org-jsonld-source] Phase: setupCompilerEnvironmentPhase
2.05 s
[schema-dot-org-jsonld-source] Build with /nix/store/k493jzz83044mqayvlb6247l35780kxy-ghc-9.10.3.
2.76 s
[schema-dot-org-jsonld-source] Phase: unpackPhase
2.77 s
[schema-dot-org-jsonld-source] unpacking source archive /nix/store/c5cz4cmp53s6yqggbjxj1bkpsbqh8ygp-schema-dot-org-jsonld
2.78 s
[schema-dot-org-jsonld-source] source root is schema-dot-org-jsonld
2.80 s
[schema-dot-org-jsonld-source] Phase: patchPhase
2.81 s
[schema-dot-org-jsonld-source] Phase: compileBuildDriverPhase
2.82 s
[schema-dot-org-jsonld-source] setupCompileFlags: -package-db=/build/tmp.sna2j1Rpt3/setup-package.conf.d -threaded
2.87 s
[schema-dot-org-jsonld-source] [1 of 2] Compiling Main ( /nix/store/4mdp8nhyfddh7bllbi7xszz7k9955n79-Setup.hs, /build/tmp.sna2j1Rpt3/Main.o )
2.91 s
[schema-dot-org-jsonld-source] [2 of 2] Linking Setup
4.07 s
[schema-dot-org-jsonld-source] Phase: updateAutotoolsGnuConfigScriptsPhase
4.09 s
[schema-dot-org-jsonld-source] Phase: configurePhase
4.09 s
[schema-dot-org-jsonld-source] configureFlags: --verbose --prefix=/nix/store/1vv1pjq9810nsfjpdsd8vqzy9m8b1zw4-schema-dot-org-jsonld-source-0.0.0.0 --libdir=$prefix/lib/$compiler/lib --libsubdir=$abi/$libname --docdir=/share/doc/schema-dot-org-jsonld-0.0.0.0 --with-gcc=gcc --package-db=/build/tmp.sna2j1Rpt3/package.conf.d --ghc-option=-j14 --ghc-option=+RTS --ghc-option=-A64M --ghc-option=-RTS --enable-library-profiling --profiling-detail=exported-functions --disable-profiling --enable-shared --disable-coverage --enable-static --disable-executable-dynamic --enable-tests --disable-benchmarks --enable-library-vanilla --disable-library-for-ghci --enable-split-sections --enable-library-stripping --enable-executable-stripping --ghc-option=-haddock --ghc-option=-Wall --ghc-option=-Werror --extra-lib-dirs=/nix/store/wl2nw5l4x4dg6kclbgpq7v9212i1s6cy-ncurses-6.6/lib --extra-lib-dirs=/nix/store/2zs4bbi72plfm8j6zxf1js4f3yc4yzwy-libffi-3.5.2/lib --extra-lib-dirs=/nix/store/qhmqdg27kcrlkl8ida6d5hiacw0y8d21-elfutils-0.194/lib --extra-lib-dirs=/nix/store/y56aqb1m3y5davn6hsv4jfbml78qw4mv-gmp-with-cxx-6.3.0/lib --extra-lib-dirs=/nix/store/wjfhh11sfcdf97mvg7hbxickybxzk850-numactl-2.0.18/lib
4.11 s
[schema-dot-org-jsonld-source] Using Parsec parser
4.11 s
[schema-dot-org-jsonld-source] Configuring schema-dot-org-jsonld-0.0.0.0...
4.86 s
[schema-dot-org-jsonld-source] Dependency aeson: using aeson-2.2.4.1
4.86 s
[schema-dot-org-jsonld-source] Dependency base >=4.7 && <5: using base-4.20.2.0
4.86 s
[schema-dot-org-jsonld-source] Dependency bytestring: using bytestring-0.12.2.0
4.86 s
[schema-dot-org-jsonld-source] Dependency schema-dot-org: using schema-dot-org-0.0.0.0
4.86 s
[schema-dot-org-jsonld-source] Dependency tagsoup: using tagsoup-0.14.8
4.86 s
[schema-dot-org-jsonld-source] Dependency text: using text-2.1.3
4.86 s
[schema-dot-org-jsonld-source] Dependency vector: using vector-0.13.2.0
4.86 s
[schema-dot-org-jsonld-source] Dependency aeson: using aeson-2.2.4.1
4.86 s
[schema-dot-org-jsonld-source] Dependency base >=4.7 && <5: using base-4.20.2.0
4.86 s
[schema-dot-org-jsonld-source] Dependency bytestring: using bytestring-0.12.2.0
4.86 s
[schema-dot-org-jsonld-source] Dependency path: using path-0.9.6
4.86 s
[schema-dot-org-jsonld-source] Dependency schema-dot-org-jsonld: using schema-dot-org-jsonld-0.0.0.0
4.86 s
[schema-dot-org-jsonld-source] Dependency sydtest: using sydtest-0.20.0.1
4.86 s
[schema-dot-org-jsonld-source] Dependency sydtest-aeson: using sydtest-aeson-0.2.0.1
4.86 s
[schema-dot-org-jsonld-source] Source component graph:
4.86 s
[schema-dot-org-jsonld-source] component lib
4.86 s
[schema-dot-org-jsonld-source] component test:schema-dot-org-jsonld-test dependency lib
4.86 s
[schema-dot-org-jsonld-source] Configured component graph:
4.86 s
[schema-dot-org-jsonld-source] component schema-dot-org-jsonld-0.0.0.0-IFXBqy7zHoeF7tncdo1uxB
4.86 s
[schema-dot-org-jsonld-source] include aeson-2.2.4.1-I5kgiCyiPJO8jEV0bEgUez
4.86 s
[schema-dot-org-jsonld-source] include base-4.20.2.0-4d66
4.86 s
[schema-dot-org-jsonld-source] include bytestring-0.12.2.0-25ef
4.86 s
[schema-dot-org-jsonld-source] include schema-dot-org-0.0.0.0-DK3bNdhkDmvFOAaebGqsq5
4.86 s
[schema-dot-org-jsonld-source] include tagsoup-0.14.8-BsqbPSEZh9W5mB1CzgSWho
4.86 s
[schema-dot-org-jsonld-source] include text-2.1.3-3f03
4.86 s
[schema-dot-org-jsonld-source] include vector-0.13.2.0-4sNODSde54Y5T3xVFmV0fE
4.86 s
[schema-dot-org-jsonld-source] component schema-dot-org-jsonld-0.0.0.0-Cu5ewoR91fM6pMI6cAFpDW-schema-dot-org-jsonld-test
4.86 s
[schema-dot-org-jsonld-source] include aeson-2.2.4.1-I5kgiCyiPJO8jEV0bEgUez
4.86 s
[schema-dot-org-jsonld-source] include base-4.20.2.0-4d66
4.86 s
[schema-dot-org-jsonld-source] include bytestring-0.12.2.0-25ef
4.86 s
[schema-dot-org-jsonld-source] include path-0.9.6-L3t3TcndY3P7bshtU9371n
4.86 s
[schema-dot-org-jsonld-source] include schema-dot-org-jsonld-0.0.0.0-IFXBqy7zHoeF7tncdo1uxB
4.86 s
[schema-dot-org-jsonld-source] include sydtest-0.20.0.1-Jo2KtBwwg0M2hH86LVxxcs
4.86 s
[schema-dot-org-jsonld-source] include sydtest-aeson-0.2.0.1-AEtebtKhgEIKIZK2rvdpfT
4.86 s
[schema-dot-org-jsonld-source] Linked component graph:
4.86 s
[schema-dot-org-jsonld-source] unit schema-dot-org-jsonld-0.0.0.0-IFXBqy7zHoeF7tncdo1uxB
4.86 s
[schema-dot-org-jsonld-source] include aeson-2.2.4.1-I5kgiCyiPJO8jEV0bEgUez
4.86 s
[schema-dot-org-jsonld-source] include base-4.20.2.0-4d66
4.86 s
[schema-dot-org-jsonld-source] include bytestring-0.12.2.0-25ef
4.86 s
[schema-dot-org-jsonld-source] include schema-dot-org-0.0.0.0-DK3bNdhkDmvFOAaebGqsq5
4.86 s
[schema-dot-org-jsonld-source] include tagsoup-0.14.8-BsqbPSEZh9W5mB1CzgSWho
4.86 s
[schema-dot-org-jsonld-source] include text-2.1.3-3f03
4.86 s
[schema-dot-org-jsonld-source] include vector-0.13.2.0-4sNODSde54Y5T3xVFmV0fE
4.86 s
[schema-dot-org-jsonld-source] SchemaDotOrg.JSONLD=schema-dot-org-jsonld-0.0.0.0-IFXBqy7zHoeF7tncdo1uxB:SchemaDotOrg.JSONLD,SchemaDotOrg.JSONLD.Parse=schema-dot-org-jsonld-0.0.0.0-IFXBqy7zHoeF7tncdo1uxB:SchemaDotOrg.JSONLD.Parse,SchemaDotOrg.JSONLD.Render=schema-dot-org-jsonld-0.0.0.0-IFXBqy7zHoeF7tncdo1uxB:SchemaDotOrg.JSONLD.Render,SchemaDotOrg.JSONLD.Tagsoup=schema-dot-org-jsonld-0.0.0.0-IFXBqy7zHoeF7tncdo1uxB:SchemaDotOrg.JSONLD.Tagsoup
4.86 s
[schema-dot-org-jsonld-source] unit schema-dot-org-jsonld-0.0.0.0-Cu5ewoR91fM6pMI6cAFpDW-schema-dot-org-jsonld-test
4.86 s
[schema-dot-org-jsonld-source] include aeson-2.2.4.1-I5kgiCyiPJO8jEV0bEgUez
4.86 s
[schema-dot-org-jsonld-source] include base-4.20.2.0-4d66
4.86 s
[schema-dot-org-jsonld-source] include bytestring-0.12.2.0-25ef
4.86 s
[schema-dot-org-jsonld-source] include path-0.9.6-L3t3TcndY3P7bshtU9371n
4.86 s
[schema-dot-org-jsonld-source] include schema-dot-org-jsonld-0.0.0.0-IFXBqy7zHoeF7tncdo1uxB
4.86 s
[schema-dot-org-jsonld-source] include sydtest-0.20.0.1-Jo2KtBwwg0M2hH86LVxxcs
4.86 s
[schema-dot-org-jsonld-source] include sydtest-aeson-0.2.0.1-AEtebtKhgEIKIZK2rvdpfT
4.86 s
[schema-dot-org-jsonld-source] Ready component graph:
4.86 s
[schema-dot-org-jsonld-source] definite schema-dot-org-jsonld-0.0.0.0-IFXBqy7zHoeF7tncdo1uxB
4.86 s
[schema-dot-org-jsonld-source] depends aeson-2.2.4.1-I5kgiCyiPJO8jEV0bEgUez
4.86 s
[schema-dot-org-jsonld-source] depends base-4.20.2.0-4d66
4.86 s
[schema-dot-org-jsonld-source] depends bytestring-0.12.2.0-25ef
4.86 s
[schema-dot-org-jsonld-source] depends schema-dot-org-0.0.0.0-DK3bNdhkDmvFOAaebGqsq5
4.86 s
[schema-dot-org-jsonld-source] depends tagsoup-0.14.8-BsqbPSEZh9W5mB1CzgSWho
4.86 s
[schema-dot-org-jsonld-source] depends text-2.1.3-3f03
4.86 s
[schema-dot-org-jsonld-source] depends vector-0.13.2.0-4sNODSde54Y5T3xVFmV0fE
4.86 s
[schema-dot-org-jsonld-source] definite schema-dot-org-jsonld-0.0.0.0-Cu5ewoR91fM6pMI6cAFpDW-schema-dot-org-jsonld-test
4.86 s
[schema-dot-org-jsonld-source] depends aeson-2.2.4.1-I5kgiCyiPJO8jEV0bEgUez
4.86 s
[schema-dot-org-jsonld-source] depends base-4.20.2.0-4d66
4.86 s
[schema-dot-org-jsonld-source] depends bytestring-0.12.2.0-25ef
4.86 s
[schema-dot-org-jsonld-source] depends path-0.9.6-L3t3TcndY3P7bshtU9371n
4.86 s
[schema-dot-org-jsonld-source] depends schema-dot-org-jsonld-0.0.0.0-IFXBqy7zHoeF7tncdo1uxB
4.86 s
[schema-dot-org-jsonld-source] depends sydtest-0.20.0.1-Jo2KtBwwg0M2hH86LVxxcs
4.86 s
[schema-dot-org-jsonld-source] depends sydtest-aeson-0.2.0.1-AEtebtKhgEIKIZK2rvdpfT
4.86 s
[schema-dot-org-jsonld-source] Using Cabal-3.12.1.0 compiled by ghc-9.10
4.86 s
[schema-dot-org-jsonld-source] Using compiler: ghc-9.10.3
4.86 s
[schema-dot-org-jsonld-source] Using install prefix:
4.86 s
[schema-dot-org-jsonld-source] /nix/store/1vv1pjq9810nsfjpdsd8vqzy9m8b1zw4-schema-dot-org-jsonld-source-0.0.0.0
4.86 s
[schema-dot-org-jsonld-source] Executables installed in:
4.86 s
[schema-dot-org-jsonld-source] /nix/store/1vv1pjq9810nsfjpdsd8vqzy9m8b1zw4-schema-dot-org-jsonld-source-0.0.0.0/bin
4.86 s
[schema-dot-org-jsonld-source] Libraries installed in:
4.86 s
[schema-dot-org-jsonld-source] /nix/store/1vv1pjq9810nsfjpdsd8vqzy9m8b1zw4-schema-dot-org-jsonld-source-0.0.0.0/lib/ghc-9.10.3/lib/x86_64-linux-ghc-9.10.3-21af/schema-dot-org-jsonld-0.0.0.0-IFXBqy7zHoeF7tncdo1uxB
4.86 s
[schema-dot-org-jsonld-source] Dynamic Libraries installed in:
4.86 s
[schema-dot-org-jsonld-source] /nix/store/1vv1pjq9810nsfjpdsd8vqzy9m8b1zw4-schema-dot-org-jsonld-source-0.0.0.0/lib/ghc-9.10.3/lib/x86_64-linux-ghc-9.10.3-21af
4.86 s
[schema-dot-org-jsonld-source] Private executables installed in:
4.86 s
[schema-dot-org-jsonld-source] /nix/store/1vv1pjq9810nsfjpdsd8vqzy9m8b1zw4-schema-dot-org-jsonld-source-0.0.0.0/libexec/x86_64-linux-ghc-9.10.3-21af/schema-dot-org-jsonld-0.0.0.0
4.86 s
[schema-dot-org-jsonld-source] Data files installed in:
4.86 s
[schema-dot-org-jsonld-source] /nix/store/1vv1pjq9810nsfjpdsd8vqzy9m8b1zw4-schema-dot-org-jsonld-source-0.0.0.0/share/x86_64-linux-ghc-9.10.3-21af/schema-dot-org-jsonld-0.0.0.0
4.86 s
[schema-dot-org-jsonld-source] Documentation installed in: /share/doc/schema-dot-org-jsonld-0.0.0.0
4.86 s
[schema-dot-org-jsonld-source] Configuration files installed in:
4.86 s
[schema-dot-org-jsonld-source] /nix/store/1vv1pjq9810nsfjpdsd8vqzy9m8b1zw4-schema-dot-org-jsonld-source-0.0.0.0/etc
4.86 s
[schema-dot-org-jsonld-source] No alex found
4.86 s
[schema-dot-org-jsonld-source] Using ar found on system at:
4.86 s
[schema-dot-org-jsonld-source] /nix/store/mbyy19mdwnfvfwmdi0gqgggx0njvpl1w-binutils-wrapper-2.46/bin/ar
4.86 s
[schema-dot-org-jsonld-source] No c2hs found
4.86 s
[schema-dot-org-jsonld-source] No cpphs found
4.86 s
[schema-dot-org-jsonld-source] No doctest found
4.86 s
[schema-dot-org-jsonld-source] Using gcc version 15.2.0 given by user at:
4.86 s
[schema-dot-org-jsonld-source] /nix/store/788mx070y81zjlg5ipcl0cra3afviw9k-gcc-wrapper-15.2.0/bin/gcc
4.86 s
[schema-dot-org-jsonld-source] Using ghc version 9.10.3 found on system at:
4.86 s
[schema-dot-org-jsonld-source] /nix/store/k493jzz83044mqayvlb6247l35780kxy-ghc-9.10.3/bin/ghc
4.86 s
[schema-dot-org-jsonld-source] Using ghc-pkg version 9.10.3 found on system at:
4.86 s
[schema-dot-org-jsonld-source] /nix/store/k493jzz83044mqayvlb6247l35780kxy-ghc-9.10.3/bin/ghc-pkg-9.10.3
4.86 s
[schema-dot-org-jsonld-source] No ghcjs found
4.86 s
[schema-dot-org-jsonld-source] No ghcjs-pkg found
4.86 s
[schema-dot-org-jsonld-source] No greencard found
4.86 s
[schema-dot-org-jsonld-source] Using haddock version 2.31.1 found on system at:
4.86 s
[schema-dot-org-jsonld-source] /nix/store/k493jzz83044mqayvlb6247l35780kxy-ghc-9.10.3/bin/haddock-ghc-9.10.3
4.86 s
[schema-dot-org-jsonld-source] No happy found
4.86 s
[schema-dot-org-jsonld-source] Using haskell-suite found on system at: haskell-suite-dummy-location
4.86 s
[schema-dot-org-jsonld-source] Using haskell-suite-pkg found on system at: haskell-suite-pkg-dummy-location
4.86 s
[schema-dot-org-jsonld-source] No hmake found
4.86 s
[schema-dot-org-jsonld-source] Using hpc version 0.69 found on system at:
4.86 s
[schema-dot-org-jsonld-source] /nix/store/k493jzz83044mqayvlb6247l35780kxy-ghc-9.10.3/bin/hpc-ghc-9.10.3
4.86 s
[schema-dot-org-jsonld-source] Using hsc2hs version 0.68.10 found on system at:
4.86 s
[schema-dot-org-jsonld-source] /nix/store/k493jzz83044mqayvlb6247l35780kxy-ghc-9.10.3/bin/hsc2hs-ghc-9.10.3
4.86 s
[schema-dot-org-jsonld-source] Using hscolour version 1.25 found on system at:
4.86 s
[schema-dot-org-jsonld-source] /nix/store/hvlf3xzdw0p5s3kybdkch6iqyz0740rc-hscolour-1.25/bin/HsColour
4.86 s
[schema-dot-org-jsonld-source] No jhc found
4.86 s
[schema-dot-org-jsonld-source] Using ld found on system at:
4.86 s
[schema-dot-org-jsonld-source] /nix/store/788mx070y81zjlg5ipcl0cra3afviw9k-gcc-wrapper-15.2.0/bin/ld
4.86 s
[schema-dot-org-jsonld-source] No pkg-config found
4.86 s
[schema-dot-org-jsonld-source] Using runghc version 9.10.3 found on system at:
4.86 s
[schema-dot-org-jsonld-source] /nix/store/k493jzz83044mqayvlb6247l35780kxy-ghc-9.10.3/bin/runghc-9.10.3
4.86 s
[schema-dot-org-jsonld-source] Using strip version 2.46 found on system at:
4.86 s
[schema-dot-org-jsonld-source] /nix/store/788mx070y81zjlg5ipcl0cra3afviw9k-gcc-wrapper-15.2.0/bin/strip
4.86 s
[schema-dot-org-jsonld-source] Using tar found on system at:
4.86 s
[schema-dot-org-jsonld-source] /nix/store/k5akwnrn9x2afaj2va7g4a2zpdim8l43-gnutar-1.35/bin/tar
4.86 s
[schema-dot-org-jsonld-source] No uhc found
5.59 s
[schema-dot-org-jsonld-source] Phase: buildPhase
5.62 s
[schema-dot-org-jsonld-source] Distribution quality errors:
5.62 s
[schema-dot-org-jsonld-source] [no-syn-desc] No 'synopsis' or 'description' field.
5.62 s
[schema-dot-org-jsonld-source] [license-none] The 'license' field is missing or is NONE.
5.62 s
[schema-dot-org-jsonld-source] Distribution quality warnings:
5.62 s
[schema-dot-org-jsonld-source] [no-category] No 'category' field.
5.62 s
[schema-dot-org-jsonld-source] [missing-upper-bounds] On library, these packages miss upper bounds:
5.62 s
[schema-dot-org-jsonld-source] - aeson
5.62 s
[schema-dot-org-jsonld-source] - bytestring
5.62 s
[schema-dot-org-jsonld-source] - schema-dot-org
5.62 s
[schema-dot-org-jsonld-source] - tagsoup
5.62 s
[schema-dot-org-jsonld-source] - text
5.62 s
[schema-dot-org-jsonld-source] - vector
5.62 s
[schema-dot-org-jsonld-source] Please add them. There is more information at https://pvp.haskell.org/
5.62 s
[schema-dot-org-jsonld-source] Note: the public hackage server would reject this package.
5.62 s
[schema-dot-org-jsonld-source] Building source dist for schema-dot-org-jsonld-0.0.0.0...
5.64 s
[schema-dot-org-jsonld-source] Source tarball created: dist/schema-dot-org-jsonld-0.0.0.0.tar.gz
5.71 s
[schema-dot-org-jsonld-source] Phase: checkPhase
5.72 s
[schema-dot-org-jsonld-source] Phase: haddockPhase
5.73 s
[schema-dot-org-jsonld-source] Phase: installPhase
5.75 s
[schema-dot-org-jsonld-source] Phase: fixupPhase
5.78 s
[schema-dot-org-jsonld-source:post-build] Uploading to the NixCI staging cache: /nix/store/1vv1pjq9810nsfjpdsd8vqzy9m8b1zw4-schema-dot-org-jsonld-source-0.0.0.0
5.82 s
[schema-dot-org-jsonld-source:post-build] warning: 'warn-short-path-literals' is deprecated, use 'lint-short-path-literals = ignore' instead
5.83 s
[schema-dot-org-jsonld-source:post-build] copying 1 paths...
5.83 s
[schema-dot-org-jsonld-source:post-build] copying path '/nix/store/1vv1pjq9810nsfjpdsd8vqzy9m8b1zw4-schema-dot-org-jsonld-source-0.0.0.0' to 'https://cache.staging.nix-ci.com'...
10.01 s
[schema-dot-org-jsonld-source:post-build] warning: 'warn-short-path-literals' is deprecated, use 'lint-short-path-literals = ignore' instead
10.23 s
[schema-dot-org-jsonld-source:post-build] copying 2 paths...
10.23 s
[schema-dot-org-jsonld-source:post-build] copying path '/nix/store/c5cz4cmp53s6yqggbjxj1bkpsbqh8ygp-schema-dot-org-jsonld' to 'https://cache.staging.nix-ci.com'...
14.06 s
[schema-dot-org-jsonld-source:post-build] copying path '/nix/store/dx2kwq0b24h76xi98lnzh6djc9q1dlbc-schema-dot-org-jsonld-source-0.0.0.0.drv' to 'https://cache.staging.nix-ci.com'...
18.62 s
Uploaded schema-dot-org-jsonld-source in 12.8s
18.62 s
Progress: 1 of 3 built
18.62 s
Built schema-dot-org-jsonld-source in 16.8s
18.66 s
Building /nix/store/xxml50x8qpinr4csm0s88q1hpaw9lj0c-schema-dot-org-jsonld-0.0.0.0.drv
18.97 s
[schema-dot-org-jsonld] Phase: setupCompilerEnvironmentPhase
18.98 s
[schema-dot-org-jsonld] Build with /nix/store/k493jzz83044mqayvlb6247l35780kxy-ghc-9.10.3.
19.67 s
[schema-dot-org-jsonld] Phase: unpackPhase
19.67 s
[schema-dot-org-jsonld] unpacking source archive /nix/store/1vv1pjq9810nsfjpdsd8vqzy9m8b1zw4-schema-dot-org-jsonld-source-0.0.0.0/schema-dot-org-jsonld-0.0.0.0.tar.gz
19.68 s
[schema-dot-org-jsonld] source root is schema-dot-org-jsonld-0.0.0.0
19.70 s
[schema-dot-org-jsonld] setting SOURCE_DATE_EPOCH to timestamp 1788937454 of file "schema-dot-org-jsonld-0.0.0.0/test/Spec.hs"
19.70 s
[schema-dot-org-jsonld] warning: file "schema-dot-org-jsonld-0.0.0.0/test/Spec.hs" may be generated; SOURCE_DATE_EPOCH may be non-deterministic
19.71 s
[schema-dot-org-jsonld] Phase: patchPhase
19.72 s
[schema-dot-org-jsonld] Phase: compileBuildDriverPhase
19.73 s
[schema-dot-org-jsonld] setupCompileFlags: -package-db=/build/tmp.7IACSqg6xf/setup-package.conf.d -threaded
19.78 s
[schema-dot-org-jsonld] [1 of 2] Compiling Main ( Setup.hs, /build/tmp.7IACSqg6xf/Main.o )
19.82 s
[schema-dot-org-jsonld] [2 of 2] Linking Setup
20.99 s
[schema-dot-org-jsonld] Phase: updateAutotoolsGnuConfigScriptsPhase
21.00 s
[schema-dot-org-jsonld] Phase: configurePhase
21.01 s
[schema-dot-org-jsonld] configureFlags: --verbose --prefix=/nix/store/difjlfnxiz0pd2himiyfkf9k6y46a6w6-schema-dot-org-jsonld-0.0.0.0 --libdir=$prefix/lib/$compiler/lib --libsubdir=$abi/$libname --docdir=/nix/store/wm84bh14yg74r9cz5w7a6nhbxjc9r27b-schema-dot-org-jsonld-0.0.0.0-doc/share/doc/schema-dot-org-jsonld-0.0.0.0 --with-gcc=gcc --package-db=/build/tmp.7IACSqg6xf/package.conf.d --ghc-option=-j14 --ghc-option=+RTS --ghc-option=-A64M --ghc-option=-RTS --enable-library-profiling --profiling-detail=exported-functions --disable-profiling --enable-shared --disable-coverage --enable-static --disable-executable-dynamic --enable-tests --disable-benchmarks --enable-library-vanilla --disable-library-for-ghci --enable-split-sections --enable-library-stripping --enable-executable-stripping --ghc-option=-haddock --ghc-option=-Wall --ghc-option=-Werror --extra-lib-dirs=/nix/store/wl2nw5l4x4dg6kclbgpq7v9212i1s6cy-ncurses-6.6/lib --extra-lib-dirs=/nix/store/2zs4bbi72plfm8j6zxf1js4f3yc4yzwy-libffi-3.5.2/lib --extra-lib-dirs=/nix/store/qhmqdg27kcrlkl8ida6d5hiacw0y8d21-elfutils-0.194/lib --extra-lib-dirs=/nix/store/y56aqb1m3y5davn6hsv4jfbml78qw4mv-gmp-with-cxx-6.3.0/lib --extra-lib-dirs=/nix/store/wjfhh11sfcdf97mvg7hbxickybxzk850-numactl-2.0.18/lib
21.02 s
[schema-dot-org-jsonld] Using Parsec parser
21.02 s
[schema-dot-org-jsonld] Configuring schema-dot-org-jsonld-0.0.0.0...
21.75 s
[schema-dot-org-jsonld] Dependency aeson: using aeson-2.2.4.1
21.75 s
[schema-dot-org-jsonld] Dependency base >=4.7 && <5: using base-4.20.2.0
21.75 s
[schema-dot-org-jsonld] Dependency bytestring: using bytestring-0.12.2.0
21.75 s
[schema-dot-org-jsonld] Dependency schema-dot-org: using schema-dot-org-0.0.0.0
21.75 s
[schema-dot-org-jsonld] Dependency tagsoup: using tagsoup-0.14.8
21.75 s
[schema-dot-org-jsonld] Dependency text: using text-2.1.3
21.75 s
[schema-dot-org-jsonld] Dependency vector: using vector-0.13.2.0
21.75 s
[schema-dot-org-jsonld] Dependency aeson: using aeson-2.2.4.1
21.75 s
[schema-dot-org-jsonld] Dependency base >=4.7 && <5: using base-4.20.2.0
21.75 s
[schema-dot-org-jsonld] Dependency bytestring: using bytestring-0.12.2.0
21.75 s
[schema-dot-org-jsonld] Dependency path: using path-0.9.6
21.75 s
[schema-dot-org-jsonld] Dependency schema-dot-org-jsonld: using schema-dot-org-jsonld-0.0.0.0
21.75 s
[schema-dot-org-jsonld] Dependency sydtest: using sydtest-0.20.0.1
21.75 s
[schema-dot-org-jsonld] Dependency sydtest-aeson: using sydtest-aeson-0.2.0.1
21.75 s
[schema-dot-org-jsonld] Source component graph:
21.75 s
[schema-dot-org-jsonld] component lib
21.75 s
[schema-dot-org-jsonld] component test:schema-dot-org-jsonld-test dependency lib
21.75 s
[schema-dot-org-jsonld] Configured component graph:
21.75 s
[schema-dot-org-jsonld] component schema-dot-org-jsonld-0.0.0.0-IFXBqy7zHoeF7tncdo1uxB
21.75 s
[schema-dot-org-jsonld] include aeson-2.2.4.1-I5kgiCyiPJO8jEV0bEgUez
21.75 s
[schema-dot-org-jsonld] include base-4.20.2.0-4d66
21.75 s
[schema-dot-org-jsonld] include bytestring-0.12.2.0-25ef
21.75 s
[schema-dot-org-jsonld] include schema-dot-org-0.0.0.0-DK3bNdhkDmvFOAaebGqsq5
21.75 s
[schema-dot-org-jsonld] include tagsoup-0.14.8-BsqbPSEZh9W5mB1CzgSWho
21.75 s
[schema-dot-org-jsonld] include text-2.1.3-3f03
21.75 s
[schema-dot-org-jsonld] include vector-0.13.2.0-4sNODSde54Y5T3xVFmV0fE
21.75 s
[schema-dot-org-jsonld] component schema-dot-org-jsonld-0.0.0.0-Cu5ewoR91fM6pMI6cAFpDW-schema-dot-org-jsonld-test
21.75 s
[schema-dot-org-jsonld] include aeson-2.2.4.1-I5kgiCyiPJO8jEV0bEgUez
21.75 s
[schema-dot-org-jsonld] include base-4.20.2.0-4d66
21.75 s
[schema-dot-org-jsonld] include bytestring-0.12.2.0-25ef
21.75 s
[schema-dot-org-jsonld] include path-0.9.6-L3t3TcndY3P7bshtU9371n
21.75 s
[schema-dot-org-jsonld] include schema-dot-org-jsonld-0.0.0.0-IFXBqy7zHoeF7tncdo1uxB
21.75 s
[schema-dot-org-jsonld] include sydtest-0.20.0.1-Jo2KtBwwg0M2hH86LVxxcs
21.75 s
[schema-dot-org-jsonld] include sydtest-aeson-0.2.0.1-AEtebtKhgEIKIZK2rvdpfT
21.75 s
[schema-dot-org-jsonld] Linked component graph:
21.75 s
[schema-dot-org-jsonld] unit schema-dot-org-jsonld-0.0.0.0-IFXBqy7zHoeF7tncdo1uxB
21.75 s
[schema-dot-org-jsonld] include aeson-2.2.4.1-I5kgiCyiPJO8jEV0bEgUez
21.75 s
[schema-dot-org-jsonld] include base-4.20.2.0-4d66
21.75 s
[schema-dot-org-jsonld] include bytestring-0.12.2.0-25ef
21.75 s
[schema-dot-org-jsonld] include schema-dot-org-0.0.0.0-DK3bNdhkDmvFOAaebGqsq5
21.75 s
[schema-dot-org-jsonld] include tagsoup-0.14.8-BsqbPSEZh9W5mB1CzgSWho
21.75 s
[schema-dot-org-jsonld] include text-2.1.3-3f03
21.75 s
[schema-dot-org-jsonld] include vector-0.13.2.0-4sNODSde54Y5T3xVFmV0fE
21.75 s
[schema-dot-org-jsonld] SchemaDotOrg.JSONLD=schema-dot-org-jsonld-0.0.0.0-IFXBqy7zHoeF7tncdo1uxB:SchemaDotOrg.JSONLD,SchemaDotOrg.JSONLD.Parse=schema-dot-org-jsonld-0.0.0.0-IFXBqy7zHoeF7tncdo1uxB:SchemaDotOrg.JSONLD.Parse,SchemaDotOrg.JSONLD.Render=schema-dot-org-jsonld-0.0.0.0-IFXBqy7zHoeF7tncdo1uxB:SchemaDotOrg.JSONLD.Render,SchemaDotOrg.JSONLD.Tagsoup=schema-dot-org-jsonld-0.0.0.0-IFXBqy7zHoeF7tncdo1uxB:SchemaDotOrg.JSONLD.Tagsoup
21.75 s
[schema-dot-org-jsonld] unit schema-dot-org-jsonld-0.0.0.0-Cu5ewoR91fM6pMI6cAFpDW-schema-dot-org-jsonld-test
21.75 s
[schema-dot-org-jsonld] include aeson-2.2.4.1-I5kgiCyiPJO8jEV0bEgUez
21.75 s
[schema-dot-org-jsonld] include base-4.20.2.0-4d66
21.75 s
[schema-dot-org-jsonld] include bytestring-0.12.2.0-25ef
21.75 s
[schema-dot-org-jsonld] include path-0.9.6-L3t3TcndY3P7bshtU9371n
21.75 s
[schema-dot-org-jsonld] include schema-dot-org-jsonld-0.0.0.0-IFXBqy7zHoeF7tncdo1uxB
21.75 s
[schema-dot-org-jsonld] include sydtest-0.20.0.1-Jo2KtBwwg0M2hH86LVxxcs
21.75 s
[schema-dot-org-jsonld] include sydtest-aeson-0.2.0.1-AEtebtKhgEIKIZK2rvdpfT
21.75 s
[schema-dot-org-jsonld] Ready component graph:
21.75 s
[schema-dot-org-jsonld] definite schema-dot-org-jsonld-0.0.0.0-IFXBqy7zHoeF7tncdo1uxB
21.75 s
[schema-dot-org-jsonld] depends aeson-2.2.4.1-I5kgiCyiPJO8jEV0bEgUez
21.75 s
[schema-dot-org-jsonld] depends base-4.20.2.0-4d66
21.75 s
[schema-dot-org-jsonld] depends bytestring-0.12.2.0-25ef
21.75 s
[schema-dot-org-jsonld] depends schema-dot-org-0.0.0.0-DK3bNdhkDmvFOAaebGqsq5
21.75 s
[schema-dot-org-jsonld] depends tagsoup-0.14.8-BsqbPSEZh9W5mB1CzgSWho
21.75 s
[schema-dot-org-jsonld] depends text-2.1.3-3f03
21.75 s
[schema-dot-org-jsonld] depends vector-0.13.2.0-4sNODSde54Y5T3xVFmV0fE
21.75 s
[schema-dot-org-jsonld] definite schema-dot-org-jsonld-0.0.0.0-Cu5ewoR91fM6pMI6cAFpDW-schema-dot-org-jsonld-test
21.75 s
[schema-dot-org-jsonld] depends aeson-2.2.4.1-I5kgiCyiPJO8jEV0bEgUez
21.75 s
[schema-dot-org-jsonld] depends base-4.20.2.0-4d66
21.75 s
[schema-dot-org-jsonld] depends bytestring-0.12.2.0-25ef
21.75 s
[schema-dot-org-jsonld] depends path-0.9.6-L3t3TcndY3P7bshtU9371n
21.75 s
[schema-dot-org-jsonld] depends schema-dot-org-jsonld-0.0.0.0-IFXBqy7zHoeF7tncdo1uxB
21.75 s
[schema-dot-org-jsonld] depends sydtest-0.20.0.1-Jo2KtBwwg0M2hH86LVxxcs
21.75 s
[schema-dot-org-jsonld] depends sydtest-aeson-0.2.0.1-AEtebtKhgEIKIZK2rvdpfT
21.75 s
[schema-dot-org-jsonld] Using Cabal-3.12.1.0 compiled by ghc-9.10
21.75 s
[schema-dot-org-jsonld] Using compiler: ghc-9.10.3
21.75 s
[schema-dot-org-jsonld] Using install prefix:
21.75 s
[schema-dot-org-jsonld] /nix/store/difjlfnxiz0pd2himiyfkf9k6y46a6w6-schema-dot-org-jsonld-0.0.0.0
21.75 s
[schema-dot-org-jsonld] Executables installed in:
21.75 s
[schema-dot-org-jsonld] /nix/store/difjlfnxiz0pd2himiyfkf9k6y46a6w6-schema-dot-org-jsonld-0.0.0.0/bin
21.75 s
[schema-dot-org-jsonld] Libraries installed in:
21.75 s
[schema-dot-org-jsonld] /nix/store/difjlfnxiz0pd2himiyfkf9k6y46a6w6-schema-dot-org-jsonld-0.0.0.0/lib/ghc-9.10.3/lib/x86_64-linux-ghc-9.10.3-21af/schema-dot-org-jsonld-0.0.0.0-IFXBqy7zHoeF7tncdo1uxB
21.75 s
[schema-dot-org-jsonld] Dynamic Libraries installed in:
21.75 s
[schema-dot-org-jsonld] /nix/store/difjlfnxiz0pd2himiyfkf9k6y46a6w6-schema-dot-org-jsonld-0.0.0.0/lib/ghc-9.10.3/lib/x86_64-linux-ghc-9.10.3-21af
21.75 s
[schema-dot-org-jsonld] Private executables installed in:
21.75 s
[schema-dot-org-jsonld] /nix/store/difjlfnxiz0pd2himiyfkf9k6y46a6w6-schema-dot-org-jsonld-0.0.0.0/libexec/x86_64-linux-ghc-9.10.3-21af/schema-dot-org-jsonld-0.0.0.0
21.75 s
[schema-dot-org-jsonld] Data files installed in:
21.75 s
[schema-dot-org-jsonld] /nix/store/difjlfnxiz0pd2himiyfkf9k6y46a6w6-schema-dot-org-jsonld-0.0.0.0/share/x86_64-linux-ghc-9.10.3-21af/schema-dot-org-jsonld-0.0.0.0
21.75 s
[schema-dot-org-jsonld] Documentation installed in:
21.75 s
[schema-dot-org-jsonld] /nix/store/wm84bh14yg74r9cz5w7a6nhbxjc9r27b-schema-dot-org-jsonld-0.0.0.0-doc/share/doc/schema-dot-org-jsonld-0.0.0.0
21.75 s
[schema-dot-org-jsonld] Configuration files installed in:
21.75 s
[schema-dot-org-jsonld] /nix/store/difjlfnxiz0pd2himiyfkf9k6y46a6w6-schema-dot-org-jsonld-0.0.0.0/etc
21.75 s
[schema-dot-org-jsonld] No alex found
21.75 s
[schema-dot-org-jsonld] Using ar found on system at:
21.75 s
[schema-dot-org-jsonld] /nix/store/mbyy19mdwnfvfwmdi0gqgggx0njvpl1w-binutils-wrapper-2.46/bin/ar
21.75 s
[schema-dot-org-jsonld] No c2hs found
21.75 s
[schema-dot-org-jsonld] No cpphs found
21.75 s
[schema-dot-org-jsonld] No doctest found
21.75 s
[schema-dot-org-jsonld] Using gcc version 15.2.0 given by user at:
21.75 s
[schema-dot-org-jsonld] /nix/store/788mx070y81zjlg5ipcl0cra3afviw9k-gcc-wrapper-15.2.0/bin/gcc
21.75 s
[schema-dot-org-jsonld] Using ghc version 9.10.3 found on system at:
21.75 s
[schema-dot-org-jsonld] /nix/store/k493jzz83044mqayvlb6247l35780kxy-ghc-9.10.3/bin/ghc
21.75 s
[schema-dot-org-jsonld] Using ghc-pkg version 9.10.3 found on system at:
21.75 s
[schema-dot-org-jsonld] /nix/store/k493jzz83044mqayvlb6247l35780kxy-ghc-9.10.3/bin/ghc-pkg-9.10.3
21.75 s
[schema-dot-org-jsonld] No ghcjs found
21.75 s
[schema-dot-org-jsonld] No ghcjs-pkg found
21.75 s
[schema-dot-org-jsonld] No greencard found
21.75 s
[schema-dot-org-jsonld] Using haddock version 2.31.1 found on system at:
21.75 s
[schema-dot-org-jsonld] /nix/store/k493jzz83044mqayvlb6247l35780kxy-ghc-9.10.3/bin/haddock-ghc-9.10.3
21.75 s
[schema-dot-org-jsonld] No happy found
21.75 s
[schema-dot-org-jsonld] Using haskell-suite found on system at: haskell-suite-dummy-location
21.75 s
[schema-dot-org-jsonld] Using haskell-suite-pkg found on system at: haskell-suite-pkg-dummy-location
21.75 s
[schema-dot-org-jsonld] No hmake found
21.75 s
[schema-dot-org-jsonld] Using hpc version 0.69 found on system at:
21.75 s
[schema-dot-org-jsonld] /nix/store/k493jzz83044mqayvlb6247l35780kxy-ghc-9.10.3/bin/hpc-ghc-9.10.3
21.75 s
[schema-dot-org-jsonld] Using hsc2hs version 0.68.10 found on system at:
21.75 s
[schema-dot-org-jsonld] /nix/store/k493jzz83044mqayvlb6247l35780kxy-ghc-9.10.3/bin/hsc2hs-ghc-9.10.3
21.75 s
[schema-dot-org-jsonld] Using hscolour version 1.25 found on system at:
21.75 s
[schema-dot-org-jsonld] /nix/store/hvlf3xzdw0p5s3kybdkch6iqyz0740rc-hscolour-1.25/bin/HsColour
21.75 s
[schema-dot-org-jsonld] No jhc found
21.75 s
[schema-dot-org-jsonld] Using ld found on system at:
21.75 s
[schema-dot-org-jsonld] /nix/store/788mx070y81zjlg5ipcl0cra3afviw9k-gcc-wrapper-15.2.0/bin/ld
21.75 s
[schema-dot-org-jsonld] No pkg-config found
21.75 s
[schema-dot-org-jsonld] Using runghc version 9.10.3 found on system at:
21.75 s
[schema-dot-org-jsonld] /nix/store/k493jzz83044mqayvlb6247l35780kxy-ghc-9.10.3/bin/runghc-9.10.3
21.75 s
[schema-dot-org-jsonld] Using strip version 2.46 found on system at:
21.75 s
[schema-dot-org-jsonld] /nix/store/788mx070y81zjlg5ipcl0cra3afviw9k-gcc-wrapper-15.2.0/bin/strip
21.75 s
[schema-dot-org-jsonld] Using tar found on system at:
21.75 s
[schema-dot-org-jsonld] /nix/store/k5akwnrn9x2afaj2va7g4a2zpdim8l43-gnutar-1.35/bin/tar
21.75 s
[schema-dot-org-jsonld] No uhc found
22.89 s
[schema-dot-org-jsonld] Phase: buildPhase
22.96 s
[schema-dot-org-jsonld] Preprocessing library for schema-dot-org-jsonld-0.0.0.0...
22.96 s
[schema-dot-org-jsonld] Building library for schema-dot-org-jsonld-0.0.0.0...
23.05 s
[schema-dot-org-jsonld] [1 of 5] Compiling Paths_schema_dot_org_jsonld ( dist/build/autogen/Paths_schema_dot_org_jsonld.hs, dist/build/Paths_schema_dot_org_jsonld.o, dist/build/Paths_schema_dot_org_jsonld.dyn_o )
23.21 s
[schema-dot-org-jsonld] [2 of 5] Compiling SchemaDotOrg.JSONLD.Parse ( src/SchemaDotOrg/JSONLD/Parse.hs, dist/build/SchemaDotOrg/JSONLD/Parse.o, dist/build/SchemaDotOrg/JSONLD/Parse.dyn_o )
23.72 s
[schema-dot-org-jsonld] [3 of 5] Compiling SchemaDotOrg.JSONLD.Render ( src/SchemaDotOrg/JSONLD/Render.hs, dist/build/SchemaDotOrg/JSONLD/Render.o, dist/build/SchemaDotOrg/JSONLD/Render.dyn_o )
23.72 s
[schema-dot-org-jsonld] [4 of 5] Compiling SchemaDotOrg.JSONLD.Tagsoup ( src/SchemaDotOrg/JSONLD/Tagsoup.hs, dist/build/SchemaDotOrg/JSONLD/Tagsoup.o, dist/build/SchemaDotOrg/JSONLD/Tagsoup.dyn_o )
23.81 s
[schema-dot-org-jsonld] [5 of 5] Compiling SchemaDotOrg.JSONLD ( src/SchemaDotOrg/JSONLD.hs, dist/build/SchemaDotOrg/JSONLD.o, dist/build/SchemaDotOrg/JSONLD.dyn_o )
24.06 s
[schema-dot-org-jsonld] [1 of 5] Compiling Paths_schema_dot_org_jsonld ( dist/build/autogen/Paths_schema_dot_org_jsonld.hs, dist/build/Paths_schema_dot_org_jsonld.p_o )
24.33 s
[schema-dot-org-jsonld] [2 of 5] Compiling SchemaDotOrg.JSONLD.Parse ( src/SchemaDotOrg/JSONLD/Parse.hs, dist/build/SchemaDotOrg/JSONLD/Parse.p_o )
24.79 s
[schema-dot-org-jsonld] [3 of 5] Compiling SchemaDotOrg.JSONLD.Render ( src/SchemaDotOrg/JSONLD/Render.hs, dist/build/SchemaDotOrg/JSONLD/Render.p_o )
24.79 s
[schema-dot-org-jsonld] [4 of 5] Compiling SchemaDotOrg.JSONLD.Tagsoup ( src/SchemaDotOrg/JSONLD/Tagsoup.hs, dist/build/SchemaDotOrg/JSONLD/Tagsoup.p_o )
24.89 s
[schema-dot-org-jsonld] [5 of 5] Compiling SchemaDotOrg.JSONLD ( src/SchemaDotOrg/JSONLD.hs, dist/build/SchemaDotOrg/JSONLD.p_o )
26.77 s
[schema-dot-org-jsonld] Preprocessing test suite 'schema-dot-org-jsonld-test' for schema-dot-org-jsonld-0.0.0.0...
26.77 s
[schema-dot-org-jsonld] Building test suite 'schema-dot-org-jsonld-test' for schema-dot-org-jsonld-0.0.0.0...
26.87 s
[schema-dot-org-jsonld] [1 of 3] Compiling Paths_schema_dot_org_jsonld ( dist/build/schema-dot-org-jsonld-test/autogen/Paths_schema_dot_org_jsonld.hs, dist/build/schema-dot-org-jsonld-test/schema-dot-org-jsonld-test-tmp/Paths_schema_dot_org_jsonld.o )
26.96 s
[schema-dot-org-jsonld] [2 of 3] Compiling SchemaDotOrg.JSONLD.TagsoupSpec ( test/SchemaDotOrg/JSONLD/TagsoupSpec.hs, dist/build/schema-dot-org-jsonld-test/schema-dot-org-jsonld-test-tmp/SchemaDotOrg/JSONLD/TagsoupSpec.o )
27.02 s
[schema-dot-org-jsonld] test/SchemaDotOrg/JSONLD/TagsoupSpec.hs:34:17: error : [ GHC-83865 ]
27.02 s
[schema-dot-org-jsonld] • Couldn't match type: Path.Internal.Posix.Path
27.02 s
[schema-dot-org-jsonld] Path.Posix.Rel Path.Posix.Dir
27.02 s
[schema-dot-org-jsonld] with: [Char]
27.02 s
[schema-dot-org-jsonld] Expected: FilePath
27.02 s
[schema-dot-org-jsonld] Actual: Path.Internal.Posix.Path Path.Posix.Rel Path.Posix.Dir
27.02 s
[schema-dot-org-jsonld] • In the first argument of ‘scenarioDir’, namely ‘resourcesDir’
27.02 s
[schema-dot-org-jsonld] In the first argument of ‘($)’, namely ‘scenarioDir resourcesDir’
27.02 s
[schema-dot-org-jsonld] In the second argument of ‘($)’, namely
27.02 s
[schema-dot-org-jsonld] ‘scenarioDir resourcesDir
27.02 s
[schema-dot-org-jsonld] $ \ file
27.02 s
[schema-dot-org-jsonld] -> when (fileExtension file == Just ".html")
27.02 s
[schema-dot-org-jsonld] $ do let ...
27.02 s
[schema-dot-org-jsonld] it (unwords [...]) $ do ...’
27.02 s
[schema-dot-org-jsonld] |
27.02 s
[schema-dot-org-jsonld] 34 | scenarioDir resourcesDir $ \file ->
27.02 s
[schema-dot-org-jsonld] | ^^^^^^^^^^^^
27.02 s
[schema-dot-org-jsonld]
27.10 s
[schema-dot-org-jsonld] test/SchemaDotOrg/JSONLD/TagsoupSpec.hs:35:27: error : [ GHC-83865 ]
27.10 s
[schema-dot-org-jsonld] • Couldn't match type: [Char]
27.10 s
[schema-dot-org-jsonld] with: Path.Internal.Posix.Path b0 Path.Posix.File
27.10 s
[schema-dot-org-jsonld] Expected: Path.Internal.Posix.Path b0 Path.Posix.File
27.10 s
[schema-dot-org-jsonld] Actual: FilePath
27.10 s
[schema-dot-org-jsonld] • In the first argument of ‘fileExtension’, namely ‘file’
27.10 s
[schema-dot-org-jsonld] In the first argument of ‘(==)’, namely ‘fileExtension file’
27.10 s
[schema-dot-org-jsonld] In the first argument of ‘when’, namely
27.10 s
[schema-dot-org-jsonld] ‘(fileExtension file == Just ".html")’
27.10 s
[schema-dot-org-jsonld] |
27.10 s
[schema-dot-org-jsonld] 35 | when (fileExtension file == Just ".html") $ do
27.10 s
[schema-dot-org-jsonld] | ^^^^
27.10 s
[schema-dot-org-jsonld]
27.10 s
[schema-dot-org-jsonld] test/SchemaDotOrg/JSONLD/TagsoupSpec.hs:36:48: error : [ GHC-83865 ]
27.10 s
[schema-dot-org-jsonld] • Couldn't match type: [Char]
27.10 s
[schema-dot-org-jsonld] with: Path.Internal.Posix.Path Path.Posix.Rel Path.Posix.File
27.10 s
[schema-dot-org-jsonld] Expected: Path.Internal.Posix.Path Path.Posix.Rel Path.Posix.File
27.10 s
[schema-dot-org-jsonld] Actual: FilePath
27.10 s
[schema-dot-org-jsonld] • In the second argument of ‘(</>)’, namely ‘file’
27.10 s
[schema-dot-org-jsonld] In the first argument of ‘fromRelFile’, namely
27.10 s
[schema-dot-org-jsonld] ‘(resourcesDir </> file)’
27.10 s
[schema-dot-org-jsonld] In the expression: fromRelFile (resourcesDir </> file)
27.10 s
[schema-dot-org-jsonld] |
27.10 s
[schema-dot-org-jsonld] 36 | let fp = fromRelFile (resourcesDir </> file )
27.10 s
[schema-dot-org-jsonld] | ^^^^
27.10 s
[schema-dot-org-jsonld]
27.26 s
Progress: 1 of 2 built (1 failed)
27.26 s
Failed to build schema-dot-org-jsonld after 8.5s
27.27 s
Cannot build ' /nix/store/xxml50x8qpinr4csm0s88q1hpaw9lj0c-schema-dot-org-jsonld-0.0.0.0.drv '.
27.27 s
Reason: builder failed with exit code 1 .
27.27 s
Output paths:
27.27 s
/nix/store/difjlfnxiz0pd2himiyfkf9k6y46a6w6-schema-dot-org-jsonld-0.0.0.0
27.27 s
/nix/store/wm84bh14yg74r9cz5w7a6nhbxjc9r27b-schema-dot-org-jsonld-0.0.0.0-doc
27.27 s
Last 203 log lines:
27.27 s
> Running phase: setupCompilerEnvironmentPhase
27.27 s
> Build with /nix/store/k493jzz83044mqayvlb6247l35780kxy-ghc-9.10.3.
27.27 s
> Running phase: unpackPhase
27.27 s
> unpacking source archive /nix/store/1vv1pjq9810nsfjpdsd8vqzy9m8b1zw4-schema-dot-org-jsonld-source-0.0.0.0/schema-dot-org-jsonld-0.0.0.0.tar.gz
27.27 s
> source root is schema-dot-org-jsonld-0.0.0.0
27.27 s
> setting SOURCE_DATE_EPOCH to timestamp 1788937454 of file "schema-dot-org-jsonld-0.0.0.0/test/Spec.hs"
27.27 s
> warning: file "schema-dot-org-jsonld-0.0.0.0/test/Spec.hs" may be generated; SOURCE_DATE_EPOCH may be non-deterministic
27.27 s
> Running phase: patchPhase
27.27 s
> Running phase: compileBuildDriverPhase
27.27 s
> setupCompileFlags: -package-db=/build/tmp.7IACSqg6xf/setup-package.conf.d -threaded
27.27 s
> [1 of 2] Compiling Main ( Setup.hs, /build/tmp.7IACSqg6xf/Main.o )
27.27 s
> [2 of 2] Linking Setup
27.27 s
> Running phase: updateAutotoolsGnuConfigScriptsPhase
27.27 s
> Running phase: configurePhase
27.27 s
> configureFlags: --verbose --prefix=/nix/store/difjlfnxiz0pd2himiyfkf9k6y46a6w6-schema-dot-org-jsonld-0.0.0.0 --libdir=$prefix/lib/$compiler/lib --libsubdir=$abi/$libname --docdir=/nix/store/wm84bh14yg74r9cz5w7a6nhbxjc9r27b-schema-dot-org-jsonld-0.0.0.0-doc/share/doc/schema-dot-org-jsonld-0.0.0.0 --with-gcc=gcc --package-db=/build/tmp.7IACSqg6xf/package.conf.d --ghc-option=-j14 --ghc-option=+RTS --ghc-option=-A64M --ghc-option=-RTS --enable-library-profiling --profiling-detail=exported-functions --disable-profiling --enable-shared --disable-coverage --enable-static --disable-executable-dynamic --enable-tests --disable-benchmarks --enable-library-vanilla --disable-library-for-ghci --enable-split-sections --enable-library-stripping --enable-executable-stripping --ghc-option=-haddock --ghc-option=-Wall --ghc-option=-Werror --extra-lib-dirs=/nix/store/wl2nw5l4x4dg6kclbgpq7v9212i1s6cy-ncurses-6.6/lib --extra-lib-dirs=/nix/store/2zs4bbi72plfm8j6zxf1js4f3yc4yzwy-libffi-3.5.2/lib --extra-lib-dirs=/nix/store/qhmqdg27kcrlkl8ida6d5hiacw0y8d21-elfutils-0.194/lib --extra-lib-dirs=/nix/store/y56aqb1m3y5davn6hsv4jfbml78qw4mv-gmp-with-cxx-6.3.0/lib --extra-lib-dirs=/nix/store/wjfhh11sfcdf97mvg7hbxickybxzk850-numactl-2.0.18/lib
27.27 s
> Using Parsec parser
27.27 s
> Configuring schema-dot-org-jsonld-0.0.0.0...
27.27 s
> Dependency aeson: using aeson-2.2.4.1
27.27 s
> Dependency base >=4.7 && <5: using base-4.20.2.0
27.27 s
> Dependency bytestring: using bytestring-0.12.2.0
27.27 s
> Dependency schema-dot-org: using schema-dot-org-0.0.0.0
27.27 s
> Dependency tagsoup: using tagsoup-0.14.8
27.27 s
> Dependency text: using text-2.1.3
27.27 s
> Dependency vector: using vector-0.13.2.0
27.27 s
> Dependency aeson: using aeson-2.2.4.1
27.27 s
> Dependency base >=4.7 && <5: using base-4.20.2.0
27.27 s
> Dependency bytestring: using bytestring-0.12.2.0
27.27 s
> Dependency path: using path-0.9.6
27.27 s
> Dependency schema-dot-org-jsonld: using schema-dot-org-jsonld-0.0.0.0
27.27 s
> Dependency sydtest: using sydtest-0.20.0.1
27.27 s
> Dependency sydtest-aeson: using sydtest-aeson-0.2.0.1
27.27 s
> Source component graph:
27.27 s
> component lib
27.27 s
> component test:schema-dot-org-jsonld-test dependency lib
27.27 s
> Configured component graph:
27.27 s
> component schema-dot-org-jsonld-0.0.0.0-IFXBqy7zHoeF7tncdo1uxB
27.27 s
> include aeson-2.2.4.1-I5kgiCyiPJO8jEV0bEgUez
27.27 s
> include base-4.20.2.0-4d66
27.27 s
> include bytestring-0.12.2.0-25ef
27.27 s
> include schema-dot-org-0.0.0.0-DK3bNdhkDmvFOAaebGqsq5
27.27 s
> include tagsoup-0.14.8-BsqbPSEZh9W5mB1CzgSWho
27.27 s
> include text-2.1.3-3f03
27.27 s
> include vector-0.13.2.0-4sNODSde54Y5T3xVFmV0fE
27.27 s
> component schema-dot-org-jsonld-0.0.0.0-Cu5ewoR91fM6pMI6cAFpDW-schema-dot-org-jsonld-test
27.27 s
> include aeson-2.2.4.1-I5kgiCyiPJO8jEV0bEgUez
27.27 s
> include base-4.20.2.0-4d66
27.27 s
> include bytestring-0.12.2.0-25ef
27.27 s
> include path-0.9.6-L3t3TcndY3P7bshtU9371n
27.27 s
> include schema-dot-org-jsonld-0.0.0.0-IFXBqy7zHoeF7tncdo1uxB
27.27 s
> include sydtest-0.20.0.1-Jo2KtBwwg0M2hH86LVxxcs
27.27 s
> include sydtest-aeson-0.2.0.1-AEtebtKhgEIKIZK2rvdpfT
27.27 s
> Linked component graph:
27.27 s
> unit schema-dot-org-jsonld-0.0.0.0-IFXBqy7zHoeF7tncdo1uxB
27.27 s
> include aeson-2.2.4.1-I5kgiCyiPJO8jEV0bEgUez
27.27 s
> include base-4.20.2.0-4d66
27.27 s
> include bytestring-0.12.2.0-25ef
27.27 s
> include schema-dot-org-0.0.0.0-DK3bNdhkDmvFOAaebGqsq5
27.27 s
> include tagsoup-0.14.8-BsqbPSEZh9W5mB1CzgSWho
27.27 s
> include text-2.1.3-3f03
27.27 s
> include vector-0.13.2.0-4sNODSde54Y5T3xVFmV0fE
27.27 s
> SchemaDotOrg.JSONLD=schema-dot-org-jsonld-0.0.0.0-IFXBqy7zHoeF7tncdo1uxB:SchemaDotOrg.JSONLD,SchemaDotOrg.JSONLD.Parse=schema-dot-org-jsonld-0.0.0.0-IFXBqy7zHoeF7tncdo1uxB:SchemaDotOrg.JSONLD.Parse,SchemaDotOrg.JSONLD.Render=schema-dot-org-jsonld-0.0.0.0-IFXBqy7zHoeF7tncdo1uxB:SchemaDotOrg.JSONLD.Render,SchemaDotOrg.JSONLD.Tagsoup=schema-dot-org-jsonld-0.0.0.0-IFXBqy7zHoeF7tncdo1uxB:SchemaDotOrg.JSONLD.Tagsoup
27.27 s
> unit schema-dot-org-jsonld-0.0.0.0-Cu5ewoR91fM6pMI6cAFpDW-schema-dot-org-jsonld-test
27.27 s
> include aeson-2.2.4.1-I5kgiCyiPJO8jEV0bEgUez
27.27 s
> include base-4.20.2.0-4d66
27.27 s
> include bytestring-0.12.2.0-25ef
27.27 s
> include path-0.9.6-L3t3TcndY3P7bshtU9371n
27.27 s
> include schema-dot-org-jsonld-0.0.0.0-IFXBqy7zHoeF7tncdo1uxB
27.27 s
> include sydtest-0.20.0.1-Jo2KtBwwg0M2hH86LVxxcs
27.27 s
> include sydtest-aeson-0.2.0.1-AEtebtKhgEIKIZK2rvdpfT
27.27 s
> Ready component graph:
27.27 s
> definite schema-dot-org-jsonld-0.0.0.0-IFXBqy7zHoeF7tncdo1uxB
27.27 s
> depends aeson-2.2.4.1-I5kgiCyiPJO8jEV0bEgUez
27.27 s
> depends base-4.20.2.0-4d66
27.27 s
> depends bytestring-0.12.2.0-25ef
27.27 s
> depends schema-dot-org-0.0.0.0-DK3bNdhkDmvFOAaebGqsq5
27.27 s
> depends tagsoup-0.14.8-BsqbPSEZh9W5mB1CzgSWho
27.27 s
> depends text-2.1.3-3f03
27.27 s
> depends vector-0.13.2.0-4sNODSde54Y5T3xVFmV0fE
27.27 s
> definite schema-dot-org-jsonld-0.0.0.0-Cu5ewoR91fM6pMI6cAFpDW-schema-dot-org-jsonld-test
27.27 s
> depends aeson-2.2.4.1-I5kgiCyiPJO8jEV0bEgUez
27.27 s
> depends base-4.20.2.0-4d66
27.27 s
> depends bytestring-0.12.2.0-25ef
27.27 s
> depends path-0.9.6-L3t3TcndY3P7bshtU9371n
27.27 s
> depends schema-dot-org-jsonld-0.0.0.0-IFXBqy7zHoeF7tncdo1uxB
27.27 s
> depends sydtest-0.20.0.1-Jo2KtBwwg0M2hH86LVxxcs
27.27 s
> depends sydtest-aeson-0.2.0.1-AEtebtKhgEIKIZK2rvdpfT
27.27 s
> Using Cabal-3.12.1.0 compiled by ghc-9.10
27.27 s
> Using compiler: ghc-9.10.3
27.27 s
> Using install prefix:
27.27 s
> /nix/store/difjlfnxiz0pd2himiyfkf9k6y46a6w6-schema-dot-org-jsonld-0.0.0.0
27.27 s
> Executables installed in:
27.27 s
> /nix/store/difjlfnxiz0pd2himiyfkf9k6y46a6w6-schema-dot-org-jsonld-0.0.0.0/bin
27.27 s
> Libraries installed in:
27.27 s
> /nix/store/difjlfnxiz0pd2himiyfkf9k6y46a6w6-schema-dot-org-jsonld-0.0.0.0/lib/ghc-9.10.3/lib/x86_64-linux-ghc-9.10.3-21af/schema-dot-org-jsonld-0.0.0.0-IFXBqy7zHoeF7tncdo1uxB
27.27 s
> Dynamic Libraries installed in:
27.27 s
> /nix/store/difjlfnxiz0pd2himiyfkf9k6y46a6w6-schema-dot-org-jsonld-0.0.0.0/lib/ghc-9.10.3/lib/x86_64-linux-ghc-9.10.3-21af
27.27 s
> Private executables installed in:
27.27 s
> /nix/store/difjlfnxiz0pd2himiyfkf9k6y46a6w6-schema-dot-org-jsonld-0.0.0.0/libexec/x86_64-linux-ghc-9.10.3-21af/schema-dot-org-jsonld-0.0.0.0
27.27 s
> Data files installed in:
27.27 s
> /nix/store/difjlfnxiz0pd2himiyfkf9k6y46a6w6-schema-dot-org-jsonld-0.0.0.0/share/x86_64-linux-ghc-9.10.3-21af/schema-dot-org-jsonld-0.0.0.0
27.27 s
> Documentation installed in:
27.27 s
> /nix/store/wm84bh14yg74r9cz5w7a6nhbxjc9r27b-schema-dot-org-jsonld-0.0.0.0-doc/share/doc/schema-dot-org-jsonld-0.0.0.0
27.27 s
> Configuration files installed in:
27.27 s
> /nix/store/difjlfnxiz0pd2himiyfkf9k6y46a6w6-schema-dot-org-jsonld-0.0.0.0/etc
27.27 s
> No alex found
27.27 s
> Using ar found on system at:
27.27 s
> /nix/store/mbyy19mdwnfvfwmdi0gqgggx0njvpl1w-binutils-wrapper-2.46/bin/ar
27.27 s
> No c2hs found
27.27 s
> No cpphs found
27.27 s
> No doctest found
27.27 s
> Using gcc version 15.2.0 given by user at:
27.27 s
> /nix/store/788mx070y81zjlg5ipcl0cra3afviw9k-gcc-wrapper-15.2.0/bin/gcc
27.27 s
> Using ghc version 9.10.3 found on system at:
27.27 s
> /nix/store/k493jzz83044mqayvlb6247l35780kxy-ghc-9.10.3/bin/ghc
27.27 s
> Using ghc-pkg version 9.10.3 found on system at:
27.27 s
> /nix/store/k493jzz83044mqayvlb6247l35780kxy-ghc-9.10.3/bin/ghc-pkg-9.10.3
27.27 s
> No ghcjs found
27.27 s
> No ghcjs-pkg found
27.27 s
> No greencard found
27.27 s
> Using haddock version 2.31.1 found on system at:
27.27 s
> /nix/store/k493jzz83044mqayvlb6247l35780kxy-ghc-9.10.3/bin/haddock-ghc-9.10.3
27.27 s
> No happy found
27.27 s
> Using haskell-suite found on system at: haskell-suite-dummy-location
27.27 s
> Using haskell-suite-pkg found on system at: haskell-suite-pkg-dummy-location
27.27 s
> No hmake found
27.27 s
> Using hpc version 0.69 found on system at:
27.27 s
> /nix/store/k493jzz83044mqayvlb6247l35780kxy-ghc-9.10.3/bin/hpc-ghc-9.10.3
27.27 s
> Using hsc2hs version 0.68.10 found on system at:
27.27 s
> /nix/store/k493jzz83044mqayvlb6247l35780kxy-ghc-9.10.3/bin/hsc2hs-ghc-9.10.3
27.27 s
> Using hscolour version 1.25 found on system at:
27.27 s
> /nix/store/hvlf3xzdw0p5s3kybdkch6iqyz0740rc-hscolour-1.25/bin/HsColour
27.27 s
> No jhc found
27.27 s
> Using ld found on system at:
27.27 s
> /nix/store/788mx070y81zjlg5ipcl0cra3afviw9k-gcc-wrapper-15.2.0/bin/ld
27.27 s
> No pkg-config found
27.27 s
> Using runghc version 9.10.3 found on system at:
27.27 s
> /nix/store/k493jzz83044mqayvlb6247l35780kxy-ghc-9.10.3/bin/runghc-9.10.3
27.27 s
> Using strip version 2.46 found on system at:
27.27 s
> /nix/store/788mx070y81zjlg5ipcl0cra3afviw9k-gcc-wrapper-15.2.0/bin/strip
27.27 s
> Using tar found on system at:
27.27 s
> /nix/store/k5akwnrn9x2afaj2va7g4a2zpdim8l43-gnutar-1.35/bin/tar
27.27 s
> No uhc found
27.27 s
> Running phase: buildPhase
27.27 s
> Preprocessing library for schema-dot-org-jsonld-0.0.0.0...
27.27 s
> Building library for schema-dot-org-jsonld-0.0.0.0...
27.27 s
> [1 of 5] Compiling Paths_schema_dot_org_jsonld ( dist/build/autogen/Paths_schema_dot_org_jsonld.hs, dist/build/Paths_schema_dot_org_jsonld.o, dist/build/Paths_schema_dot_org_jsonld.dyn_o )
27.27 s
> [2 of 5] Compiling SchemaDotOrg.JSONLD.Parse ( src/SchemaDotOrg/JSONLD/Parse.hs, dist/build/SchemaDotOrg/JSONLD/Parse.o, dist/build/SchemaDotOrg/JSONLD/Parse.dyn_o )
27.27 s
> [3 of 5] Compiling SchemaDotOrg.JSONLD.Render ( src/SchemaDotOrg/JSONLD/Render.hs, dist/build/SchemaDotOrg/JSONLD/Render.o, dist/build/SchemaDotOrg/JSONLD/Render.dyn_o )
27.27 s
> [4 of 5] Compiling SchemaDotOrg.JSONLD.Tagsoup ( src/SchemaDotOrg/JSONLD/Tagsoup.hs, dist/build/SchemaDotOrg/JSONLD/Tagsoup.o, dist/build/SchemaDotOrg/JSONLD/Tagsoup.dyn_o )
27.27 s
> [5 of 5] Compiling SchemaDotOrg.JSONLD ( src/SchemaDotOrg/JSONLD.hs, dist/build/SchemaDotOrg/JSONLD.o, dist/build/SchemaDotOrg/JSONLD.dyn_o )
27.27 s
> [1 of 5] Compiling Paths_schema_dot_org_jsonld ( dist/build/autogen/Paths_schema_dot_org_jsonld.hs, dist/build/Paths_schema_dot_org_jsonld.p_o )
27.27 s
> [2 of 5] Compiling SchemaDotOrg.JSONLD.Parse ( src/SchemaDotOrg/JSONLD/Parse.hs, dist/build/SchemaDotOrg/JSONLD/Parse.p_o )
27.27 s
> [3 of 5] Compiling SchemaDotOrg.JSONLD.Render ( src/SchemaDotOrg/JSONLD/Render.hs, dist/build/SchemaDotOrg/JSONLD/Render.p_o )
27.27 s
> [4 of 5] Compiling SchemaDotOrg.JSONLD.Tagsoup ( src/SchemaDotOrg/JSONLD/Tagsoup.hs, dist/build/SchemaDotOrg/JSONLD/Tagsoup.p_o )
27.27 s
> [5 of 5] Compiling SchemaDotOrg.JSONLD ( src/SchemaDotOrg/JSONLD.hs, dist/build/SchemaDotOrg/JSONLD.p_o )
27.27 s
> Preprocessing test suite 'schema-dot-org-jsonld-test' for schema-dot-org-jsonld-0.0.0.0...
27.27 s
> Building test suite 'schema-dot-org-jsonld-test' for schema-dot-org-jsonld-0.0.0.0...
27.27 s
> [1 of 3] Compiling Paths_schema_dot_org_jsonld ( dist/build/schema-dot-org-jsonld-test/autogen/Paths_schema_dot_org_jsonld.hs, dist/build/schema-dot-org-jsonld-test/schema-dot-org-jsonld-test-tmp/Paths_schema_dot_org_jsonld.o )
27.27 s
> [2 of 3] Compiling SchemaDotOrg.JSONLD.TagsoupSpec ( test/SchemaDotOrg/JSONLD/TagsoupSpec.hs, dist/build/schema-dot-org-jsonld-test/schema-dot-org-jsonld-test-tmp/SchemaDotOrg/JSONLD/TagsoupSpec.o )
27.27 s
> test/SchemaDotOrg/JSONLD/TagsoupSpec.hs:34:17: error : [ GHC-83865 ]
27.27 s
> • Couldn't match type: Path.Internal.Posix.Path
27.27 s
> Path.Posix.Rel Path.Posix.Dir
27.27 s
> with: [Char]
27.27 s
> Expected: FilePath
27.27 s
> Actual: Path.Internal.Posix.Path Path.Posix.Rel Path.Posix.Dir
27.27 s
> • In the first argument of ‘scenarioDir’, namely ‘resourcesDir’
27.27 s
> In the first argument of ‘($)’, namely ‘scenarioDir resourcesDir’
27.27 s
> In the second argument of ‘($)’, namely
27.27 s
> ‘scenarioDir resourcesDir
27.27 s
> $ \ file
27.27 s
> -> when (fileExtension file == Just ".html")
27.27 s
> $ do let ...
27.27 s
> it (unwords [...]) $ do ...’
27.27 s
> |
27.27 s
> 34 | scenarioDir resourcesDir $ \file ->
27.27 s
> | ^^^^^^^^^^^^
27.27 s
>
27.27 s
> test/SchemaDotOrg/JSONLD/TagsoupSpec.hs:35:27: error : [ GHC-83865 ]
27.27 s
> • Couldn't match type: [Char]
27.27 s
> with: Path.Internal.Posix.Path b0 Path.Posix.File
27.27 s
> Expected: Path.Internal.Posix.Path b0 Path.Posix.File
27.27 s
> Actual: FilePath
27.27 s
> • In the first argument of ‘fileExtension’, namely ‘file’
27.27 s
> In the first argument of ‘(==)’, namely ‘fileExtension file’
27.27 s
> In the first argument of ‘when’, namely
27.27 s
> ‘(fileExtension file == Just ".html")’
27.27 s
> |
27.27 s
> 35 | when (fileExtension file == Just ".html") $ do
27.27 s
> | ^^^^
27.27 s
>
27.27 s
> test/SchemaDotOrg/JSONLD/TagsoupSpec.hs:36:48: error : [ GHC-83865 ]
27.27 s
> • Couldn't match type: [Char]
27.27 s
> with: Path.Internal.Posix.Path Path.Posix.Rel Path.Posix.File
27.27 s
> Expected: Path.Internal.Posix.Path Path.Posix.Rel Path.Posix.File
27.27 s
> Actual: FilePath
27.27 s
> • In the second argument of ‘(</>)’, namely ‘file’
27.27 s
> In the first argument of ‘fromRelFile’, namely
27.27 s
> ‘(resourcesDir </> file)’
27.27 s
> In the expression: fromRelFile (resourcesDir </> file)
27.27 s
> |
27.27 s
> 36 | let fp = fromRelFile (resourcesDir </> file )
27.27 s
> | ^^^^
27.27 s
>
27.27 s
For full logs, run:
27.27 s
nix log /nix/store/xxml50x8qpinr4csm0s88q1hpaw9lj0c-schema-dot-org-jsonld-0.0.0.0.drv
28.08 s
Build failed.