build checks.x86_64-linux.jsonld

Queued Started Finished

Reproduce this run
Retry Run
  1. 0.00 s $ /nix/store/9ypz3flqsrl5xl495mm8h645gadjsxi1-coreutils-9.11/bin/timeout --kill-after=15s 7200s /nix/store/23zk8sgzamrbmj1fday15szf7f2279s8-nix-2.34.7/bin/nix --extra-experimental-features nix-command --extra-experimental-features flakes --log-format internal-json build --no-link --print-out-paths git+https://github.com/NorfairKing/schema-dot-org?ref=typed-scenario-paths&rev=297196effc1f100da1ebbcabab899c0ad96b1f19&shallow=1#checks.x86_64-linux.jsonld --print-build-logs
  2. 1.30 s
  3. 1.91 s Downloading cached sydtest-discover-0.0.0.4-doc from https://cache.staging.nix-ci.com
  4. 1.92 s Downloading cached fast-myers-diff-0.0.1-doc from https://cache.staging.nix-ci.com
  5. 1.92 s Downloading cached validity-0.12.1.0-doc from https://cache.staging.nix-ci.com
  6. 2.08 s Downloaded cached fast-myers-diff-0.0.1-doc (497 KiB) in 161ms
  7. 2.08 s Progress: 0 of 5 built, 1 of 40 downloaded from cache (2 downloading)
  8. 2.09 s Downloading cached fast-myers-diff from https://cache.staging.nix-ci.com
  9. 2.09 s Downloaded cached validity-0.12.1.0-doc (849 KiB) in 175ms
  10. 2.09 s Progress: 0 of 5 built, 2 of 40 downloaded from cache (2 downloading)
  11. 2.09 s Downloading cached validity from https://cache.staging.nix-ci.com
  12. 2.09 s Downloading cached validity-bytestring-0.4.1.1-doc from https://cache.staging.nix-ci.com
  13. 2.09 s Downloading cached validity-containers-0.5.0.5-doc from https://cache.staging.nix-ci.com
  14. 2.11 s Downloading cached validity-scientific-0.2.0.3-doc from https://cache.staging.nix-ci.com
  15. 2.11 s Downloading cached validity-text-0.3.1.3-doc from https://cache.staging.nix-ci.com
  16. 2.11 s Downloading cached validity-unordered-containers-0.2.0.3-doc from https://cache.staging.nix-ci.com
  17. 2.11 s Downloading cached validity-vector-0.2.0.3-doc from https://cache.staging.nix-ci.com
  18. 2.13 s Downloaded cached sydtest-discover-0.0.0.4-doc (282 KiB) in 219ms
  19. 2.13 s Progress: 0 of 5 built, 3 of 40 downloaded from cache (8 downloading)
  20. 2.13 s Downloading cached sydtest-discover from https://cache.staging.nix-ci.com
  21. 2.16 s Downloaded cached validity (1.5 MiB) in 65ms
  22. 2.16 s Progress: 0 of 5 built, 4 of 40 downloaded from cache (8 downloading)
  23. 2.24 s Downloaded cached validity-bytestring-0.4.1.1-doc (162 KiB) in 144ms
  24. 2.24 s Progress: 0 of 5 built, 5 of 40 downloaded from cache (7 downloading)
  25. 2.25 s Downloading cached validity-bytestring from https://cache.staging.nix-ci.com
  26. 2.26 s Downloaded cached validity-text-0.3.1.3-doc (184 KiB) in 143ms
  27. 2.26 s Progress: 0 of 5 built, 6 of 40 downloaded from cache (7 downloading)
  28. 2.26 s Downloaded cached validity-containers-0.5.0.5-doc (218 KiB) in 163ms
  29. 2.26 s Downloading cached safe-coloured-text-0.3.0.2-doc from https://cache.staging.nix-ci.com
  30. 2.26 s Downloading cached validity-text from https://cache.staging.nix-ci.com
  31. 2.26 s Progress: 0 of 5 built, 7 of 40 downloaded from cache (8 downloading)
  32. 2.26 s Downloading cached validity-containers from https://cache.staging.nix-ci.com
  33. 2.29 s Downloaded cached fast-myers-diff (1.4 MiB) in 204ms
  34. 2.30 s Progress: 0 of 5 built, 8 of 40 downloaded from cache (8 downloading)
  35. 2.30 s Downloaded cached validity-unordered-containers-0.2.0.3-doc (164 KiB) in 183ms
  36. 2.30 s Progress: 0 of 5 built, 9 of 40 downloaded from cache (7 downloading)
  37. 2.30 s Downloading cached validity-unordered-containers from https://cache.staging.nix-ci.com
  38. 2.30 s Downloaded cached sydtest-discover (3.8 MiB) in 166ms
  39. 2.30 s Progress: 0 of 5 built, 10 of 40 downloaded from cache (7 downloading)
  40. 2.30 s Downloaded cached validity-scientific-0.2.0.3-doc (146 KiB) in 183ms
  41. 2.30 s Progress: 0 of 4 built, 11 of 40 downloaded from cache (6 downloading)
  42. 2.30 s Downloaded cached validity-vector-0.2.0.3-doc (155 KiB) in 183ms
  43. 2.30 s Downloading cached autodocodec-0.5.0.0-doc from https://cache.staging.nix-ci.com
  44. 2.30 s Progress: 0 of 4 built, 12 of 40 downloaded from cache (7 downloading)
  45. 2.30 s Downloading cached validity-scientific from https://cache.staging.nix-ci.com
  46. 2.30 s Downloading cached validity-aeson-0.2.0.5-doc from https://cache.staging.nix-ci.com
  47. 2.30 s Downloading cached validity-vector from https://cache.staging.nix-ci.com
  48. 2.32 s Downloaded cached safe-coloured-text-0.3.0.2-doc (1.1 MiB) in 60ms
  49. 2.32 s Progress: 0 of 4 built, 13 of 40 downloaded from cache (8 downloading)
  50. 2.32 s Downloading cached safe-coloured-text-layout-0.2.0.1-doc from https://cache.staging.nix-ci.com
  51. 2.32 s Downloading cached safe-coloured-text-terminfo-0.3.0.0-doc from https://cache.staging.nix-ci.com
  52. 2.42 s Downloaded cached validity-bytestring (342 KiB) in 170ms
  53. 2.42 s Progress: 0 of 4 built, 14 of 40 downloaded from cache (9 downloading)
  54. 2.44 s Downloaded cached validity-containers (606 KiB) in 183ms
  55. 2.44 s Progress: 0 of 4 built, 15 of 40 downloaded from cache (8 downloading)
  56. 2.45 s Downloaded cached validity-unordered-containers (402 KiB) in 151ms
  57. 2.45 s Progress: 0 of 4 built, 16 of 40 downloaded from cache (7 downloading)
  58. 2.45 s Downloaded cached validity-vector (349 KiB) in 153ms
  59. 2.45 s Progress: 0 of 4 built, 17 of 40 downloaded from cache (6 downloading)
  60. 2.46 s Downloaded cached safe-coloured-text-terminfo-0.3.0.0-doc (197 KiB) in 142ms
  61. 2.46 s Progress: 0 of 4 built, 18 of 40 downloaded from cache (5 downloading)
  62. 2.47 s Downloaded cached validity-scientific (291 KiB) in 171ms
  63. 2.47 s Progress: 0 of 4 built, 19 of 40 downloaded from cache (4 downloading)
  64. 2.48 s Downloaded cached validity-aeson-0.2.0.5-doc (178 KiB) in 185ms
  65. 2.48 s Progress: 0 of 4 built, 20 of 40 downloaded from cache (3 downloading)
  66. 2.49 s Downloaded cached safe-coloured-text-layout-0.2.0.1-doc (291 KiB) in 173ms
  67. 2.49 s Progress: 0 of 4 built, 21 of 40 downloaded from cache (2 downloading)
  68. 2.51 s Downloaded cached validity-text (420 KiB) in 248ms
  69. 2.51 s Progress: 0 of 4 built, 22 of 40 downloaded from cache (1 downloading)
  70. 2.51 s Downloading cached safe-coloured-text from https://cache.staging.nix-ci.com
  71. 2.52 s Downloading cached validity-aeson from https://cache.staging.nix-ci.com
  72. 2.56 s Downloaded cached autodocodec-0.5.0.0-doc (2.8 MiB) in 266ms
  73. 2.56 s Progress: 0 of 4 built, 23 of 40 downloaded from cache (2 downloading)
  74. 2.56 s Downloading cached autodocodec from https://cache.staging.nix-ci.com
  75. 2.56 s Downloading cached autodocodec-nix-0.1.0.0-doc from https://cache.staging.nix-ci.com
  76. 2.56 s Downloading cached autodocodec-schema-0.2.0.1-doc from https://cache.staging.nix-ci.com
  77. 2.69 s Downloaded cached validity-aeson (409 KiB) in 175ms
  78. 2.69 s Progress: 0 of 4 built, 24 of 40 downloaded from cache (4 downloading)
  79. 2.71 s Downloaded cached safe-coloured-text (4.1 MiB) in 200ms
  80. 2.71 s Progress: 0 of 4 built, 25 of 40 downloaded from cache (3 downloading)
  81. 2.71 s Downloading cached safe-coloured-text-terminfo from https://cache.staging.nix-ci.com
  82. 2.72 s Downloaded cached autodocodec-nix-0.1.0.0-doc (649 KiB) in 155ms
  83. 2.72 s Progress: 0 of 4 built, 26 of 40 downloaded from cache (4 downloading)
  84. 2.73 s Downloaded cached autodocodec-schema-0.2.0.1-doc (741 KiB) in 164ms
  85. 2.73 s Progress: 0 of 4 built, 27 of 40 downloaded from cache (3 downloading)
  86. 2.73 s Downloading cached autodocodec-yaml-0.4.0.2-doc from https://cache.staging.nix-ci.com
  87. 2.75 s Downloading cached safe-coloured-text-layout from https://cache.staging.nix-ci.com
  88. 2.77 s Downloaded cached autodocodec (5.7 MiB) in 209ms
  89. 2.77 s Progress: 0 of 4 built, 28 of 40 downloaded from cache (3 downloading)
  90. 2.77 s Downloading cached autodocodec-nix from https://cache.staging.nix-ci.com
  91. 2.77 s Downloading cached autodocodec-schema from https://cache.staging.nix-ci.com
  92. 2.87 s Downloaded cached safe-coloured-text-terminfo (458 KiB) in 166ms
  93. 2.87 s Progress: 0 of 4 built, 29 of 40 downloaded from cache (4 downloading)
  94. 2.88 s Downloaded cached autodocodec-yaml-0.4.0.2-doc (536 KiB) in 149ms
  95. 2.88 s Progress: 0 of 4 built, 30 of 40 downloaded from cache (3 downloading)
  96. 2.88 s Downloading cached opt-env-conf-0.9.0.0-doc from https://cache.staging.nix-ci.com
  97. 2.99 s Downloaded cached autodocodec-schema (3.4 MiB) in 216ms
  98. 2.99 s Progress: 0 of 4 built, 31 of 40 downloaded from cache (3 downloading)
  99. 2.99 s Downloading cached autodocodec-yaml from https://cache.staging.nix-ci.com
  100. 2.99 s Downloaded cached autodocodec-nix (2.3 MiB) in 220ms
  101. 3.00 s Progress: 0 of 4 built, 32 of 40 downloaded from cache (3 downloading)
  102. 3.01 s Downloaded cached safe-coloured-text-layout (836 KiB) in 262ms
  103. 3.01 s Progress: 0 of 4 built, 33 of 40 downloaded from cache (2 downloading)
  104. 3.07 s Downloaded cached opt-env-conf-0.9.0.0-doc (5.3 MiB) in 191ms
  105. 3.07 s Progress: 0 of 4 built, 34 of 40 downloaded from cache (1 downloading)
  106. 3.07 s Downloading cached sydtest-0.20.0.1-doc from https://cache.staging.nix-ci.com
  107. 3.14 s Downloaded cached autodocodec-yaml (1.3 MiB) in 149ms
  108. 3.14 s Progress: 0 of 4 built, 35 of 40 downloaded from cache (1 downloading)
  109. 3.15 s Downloading cached opt-env-conf from https://cache.staging.nix-ci.com
  110. 3.24 s Downloaded cached sydtest-0.20.0.1-doc (6.3 MiB) in 171ms
  111. 3.24 s Progress: 0 of 4 built, 36 of 40 downloaded from cache (1 downloading)
  112. 3.25 s Downloading cached sydtest-aeson-0.2.0.1-doc from https://cache.staging.nix-ci.com
  113. 3.43 s Downloaded cached sydtest-aeson-0.2.0.1-doc (208 KiB) in 179ms
  114. 3.43 s Progress: 0 of 4 built, 37 of 40 downloaded from cache (1 downloading)
  115. 3.53 s Downloaded cached opt-env-conf (16.1 MiB) in 376ms
  116. 3.53 s Progress: 0 of 4 built, 38 of 40 downloaded from cache
  117. 3.54 s Downloading cached sydtest from https://cache.staging.nix-ci.com
  118. 3.84 s Downloaded cached sydtest (17 MiB) in 302ms
  119. 3.84 s Progress: 0 of 4 built, 39 of 40 downloaded from cache
  120. 3.84 s Downloading cached sydtest-aeson from https://cache.staging.nix-ci.com
  121. 4.03 s Downloaded cached sydtest-aeson (499 KiB) in 195ms
  122. 4.04 s Progress: 0 of 3 built, 40 of 40 downloaded from cache
  123. 4.14 s Building /nix/store/cvzwjiwmkmfp3v7s917ic2vl87zfvk8b-schema-dot-org-jsonld-source-0.0.0.0.drv
  124. 4.47 s [schema-dot-org-jsonld-source] Phase: setupCompilerEnvironmentPhase
  125. 4.48 s [schema-dot-org-jsonld-source] Build with /nix/store/k493jzz83044mqayvlb6247l35780kxy-ghc-9.10.3.
  126. 5.32 s [schema-dot-org-jsonld-source] Phase: unpackPhase
  127. 5.33 s [schema-dot-org-jsonld-source] unpacking source archive /nix/store/i9l2iazgis2p4z8145vn5sdzy38rg1hw-schema-dot-org-jsonld
  128. 5.34 s [schema-dot-org-jsonld-source] source root is schema-dot-org-jsonld
  129. 5.36 s [schema-dot-org-jsonld-source] Phase: patchPhase
  130. 5.37 s [schema-dot-org-jsonld-source] Phase: compileBuildDriverPhase
  131. 5.38 s [schema-dot-org-jsonld-source] setupCompileFlags: -package-db=/build/tmp.76q2AR5Ty8/setup-package.conf.d -threaded
  132. 5.46 s [schema-dot-org-jsonld-source] [1 of 2] Compiling Main ( /nix/store/4mdp8nhyfddh7bllbi7xszz7k9955n79-Setup.hs, /build/tmp.76q2AR5Ty8/Main.o )
  133. 5.52 s [schema-dot-org-jsonld-source] [2 of 2] Linking Setup
  134. 6.79 s [schema-dot-org-jsonld-source] Phase: updateAutotoolsGnuConfigScriptsPhase
  135. 6.82 s [schema-dot-org-jsonld-source] Phase: configurePhase
  136. 6.83 s [schema-dot-org-jsonld-source] configureFlags: --verbose --prefix=/nix/store/hb3jb890fys3ax489w29v44nlv0nznpf-schema-dot-org-jsonld-source-0.0.0.0 --libdir=$prefix/lib/$compiler/lib --libsubdir=$abi/$libname --docdir=/share/doc/schema-dot-org-jsonld-0.0.0.0 --with-gcc=gcc --package-db=/build/tmp.76q2AR5Ty8/package.conf.d --ghc-option=-j14 --ghc-option=+RTS --ghc-option=-A64M --ghc-option=-RTS --enable-library-profiling --profiling-detail=exported-functions --disable-profiling --enable-shared --disable-coverage --enable-static --disable-executable-dynamic --enable-tests --disable-benchmarks --enable-library-vanilla --disable-library-for-ghci --enable-split-sections --enable-library-stripping --enable-executable-stripping --ghc-option=-haddock --ghc-option=-Wall --ghc-option=-Werror --extra-lib-dirs=/nix/store/wl2nw5l4x4dg6kclbgpq7v9212i1s6cy-ncurses-6.6/lib --extra-lib-dirs=/nix/store/2zs4bbi72plfm8j6zxf1js4f3yc4yzwy-libffi-3.5.2/lib --extra-lib-dirs=/nix/store/qhmqdg27kcrlkl8ida6d5hiacw0y8d21-elfutils-0.194/lib --extra-lib-dirs=/nix/store/y56aqb1m3y5davn6hsv4jfbml78qw4mv-gmp-with-cxx-6.3.0/lib --extra-lib-dirs=/nix/store/wjfhh11sfcdf97mvg7hbxickybxzk850-numactl-2.0.18/lib
  137. 6.84 s [schema-dot-org-jsonld-source] Using Parsec parser
  138. 6.84 s [schema-dot-org-jsonld-source] Configuring schema-dot-org-jsonld-0.0.0.0...
  139. 7.69 s [schema-dot-org-jsonld-source] Dependency aeson: using aeson-2.2.4.1
  140. 7.69 s [schema-dot-org-jsonld-source] Dependency base >=4.7 && <5: using base-4.20.2.0
  141. 7.69 s [schema-dot-org-jsonld-source] Dependency bytestring: using bytestring-0.12.2.0
  142. 7.69 s [schema-dot-org-jsonld-source] Dependency schema-dot-org: using schema-dot-org-0.0.0.0
  143. 7.69 s [schema-dot-org-jsonld-source] Dependency tagsoup: using tagsoup-0.14.8
  144. 7.69 s [schema-dot-org-jsonld-source] Dependency text: using text-2.1.3
  145. 7.69 s [schema-dot-org-jsonld-source] Dependency vector: using vector-0.13.2.0
  146. 7.69 s [schema-dot-org-jsonld-source] Dependency aeson: using aeson-2.2.4.1
  147. 7.69 s [schema-dot-org-jsonld-source] Dependency base >=4.7 && <5: using base-4.20.2.0
  148. 7.69 s [schema-dot-org-jsonld-source] Dependency bytestring: using bytestring-0.12.2.0
  149. 7.69 s [schema-dot-org-jsonld-source] Dependency path: using path-0.9.6
  150. 7.69 s [schema-dot-org-jsonld-source] Dependency schema-dot-org-jsonld: using schema-dot-org-jsonld-0.0.0.0
  151. 7.69 s [schema-dot-org-jsonld-source] Dependency sydtest: using sydtest-0.20.0.1
  152. 7.69 s [schema-dot-org-jsonld-source] Dependency sydtest-aeson: using sydtest-aeson-0.2.0.1
  153. 7.69 s [schema-dot-org-jsonld-source] Source component graph:
  154. 7.69 s [schema-dot-org-jsonld-source] component lib
  155. 7.69 s [schema-dot-org-jsonld-source] component test:schema-dot-org-jsonld-test dependency lib
  156. 7.69 s [schema-dot-org-jsonld-source] Configured component graph:
  157. 7.69 s [schema-dot-org-jsonld-source] component schema-dot-org-jsonld-0.0.0.0-IFXBqy7zHoeF7tncdo1uxB
  158. 7.69 s [schema-dot-org-jsonld-source] include aeson-2.2.4.1-I5kgiCyiPJO8jEV0bEgUez
  159. 7.69 s [schema-dot-org-jsonld-source] include base-4.20.2.0-4d66
  160. 7.69 s [schema-dot-org-jsonld-source] include bytestring-0.12.2.0-25ef
  161. 7.69 s [schema-dot-org-jsonld-source] include schema-dot-org-0.0.0.0-DK3bNdhkDmvFOAaebGqsq5
  162. 7.69 s [schema-dot-org-jsonld-source] include tagsoup-0.14.8-BsqbPSEZh9W5mB1CzgSWho
  163. 7.69 s [schema-dot-org-jsonld-source] include text-2.1.3-3f03
  164. 7.69 s [schema-dot-org-jsonld-source] include vector-0.13.2.0-4sNODSde54Y5T3xVFmV0fE
  165. 7.69 s [schema-dot-org-jsonld-source] component schema-dot-org-jsonld-0.0.0.0-Cu5ewoR91fM6pMI6cAFpDW-schema-dot-org-jsonld-test
  166. 7.69 s [schema-dot-org-jsonld-source] include aeson-2.2.4.1-I5kgiCyiPJO8jEV0bEgUez
  167. 7.69 s [schema-dot-org-jsonld-source] include base-4.20.2.0-4d66
  168. 7.69 s [schema-dot-org-jsonld-source] include bytestring-0.12.2.0-25ef
  169. 7.69 s [schema-dot-org-jsonld-source] include path-0.9.6-L3t3TcndY3P7bshtU9371n
  170. 7.69 s [schema-dot-org-jsonld-source] include schema-dot-org-jsonld-0.0.0.0-IFXBqy7zHoeF7tncdo1uxB
  171. 7.69 s [schema-dot-org-jsonld-source] include sydtest-0.20.0.1-Jo2KtBwwg0M2hH86LVxxcs
  172. 7.69 s [schema-dot-org-jsonld-source] include sydtest-aeson-0.2.0.1-AEtebtKhgEIKIZK2rvdpfT
  173. 7.69 s [schema-dot-org-jsonld-source] Linked component graph:
  174. 7.69 s [schema-dot-org-jsonld-source] unit schema-dot-org-jsonld-0.0.0.0-IFXBqy7zHoeF7tncdo1uxB
  175. 7.69 s [schema-dot-org-jsonld-source] include aeson-2.2.4.1-I5kgiCyiPJO8jEV0bEgUez
  176. 7.69 s [schema-dot-org-jsonld-source] include base-4.20.2.0-4d66
  177. 7.69 s [schema-dot-org-jsonld-source] include bytestring-0.12.2.0-25ef
  178. 7.69 s [schema-dot-org-jsonld-source] include schema-dot-org-0.0.0.0-DK3bNdhkDmvFOAaebGqsq5
  179. 7.69 s [schema-dot-org-jsonld-source] include tagsoup-0.14.8-BsqbPSEZh9W5mB1CzgSWho
  180. 7.69 s [schema-dot-org-jsonld-source] include text-2.1.3-3f03
  181. 7.69 s [schema-dot-org-jsonld-source] include vector-0.13.2.0-4sNODSde54Y5T3xVFmV0fE
  182. 7.69 s [schema-dot-org-jsonld-source] SchemaDotOrg.JSONLD=schema-dot-org-jsonld-0.0.0.0-IFXBqy7zHoeF7tncdo1uxB:SchemaDotOrg.JSONLD,SchemaDotOrg.JSONLD.Parse=schema-dot-org-jsonld-0.0.0.0-IFXBqy7zHoeF7tncdo1uxB:SchemaDotOrg.JSONLD.Parse,SchemaDotOrg.JSONLD.Render=schema-dot-org-jsonld-0.0.0.0-IFXBqy7zHoeF7tncdo1uxB:SchemaDotOrg.JSONLD.Render,SchemaDotOrg.JSONLD.Tagsoup=schema-dot-org-jsonld-0.0.0.0-IFXBqy7zHoeF7tncdo1uxB:SchemaDotOrg.JSONLD.Tagsoup
  183. 7.69 s [schema-dot-org-jsonld-source] unit schema-dot-org-jsonld-0.0.0.0-Cu5ewoR91fM6pMI6cAFpDW-schema-dot-org-jsonld-test
  184. 7.69 s [schema-dot-org-jsonld-source] include aeson-2.2.4.1-I5kgiCyiPJO8jEV0bEgUez
  185. 7.69 s [schema-dot-org-jsonld-source] include base-4.20.2.0-4d66
  186. 7.69 s [schema-dot-org-jsonld-source] include bytestring-0.12.2.0-25ef
  187. 7.69 s [schema-dot-org-jsonld-source] include path-0.9.6-L3t3TcndY3P7bshtU9371n
  188. 7.69 s [schema-dot-org-jsonld-source] include schema-dot-org-jsonld-0.0.0.0-IFXBqy7zHoeF7tncdo1uxB
  189. 7.69 s [schema-dot-org-jsonld-source] include sydtest-0.20.0.1-Jo2KtBwwg0M2hH86LVxxcs
  190. 7.69 s [schema-dot-org-jsonld-source] include sydtest-aeson-0.2.0.1-AEtebtKhgEIKIZK2rvdpfT
  191. 7.69 s [schema-dot-org-jsonld-source] Ready component graph:
  192. 7.69 s [schema-dot-org-jsonld-source] definite schema-dot-org-jsonld-0.0.0.0-IFXBqy7zHoeF7tncdo1uxB
  193. 7.69 s [schema-dot-org-jsonld-source] depends aeson-2.2.4.1-I5kgiCyiPJO8jEV0bEgUez
  194. 7.69 s [schema-dot-org-jsonld-source] depends base-4.20.2.0-4d66
  195. 7.69 s [schema-dot-org-jsonld-source] depends bytestring-0.12.2.0-25ef
  196. 7.69 s [schema-dot-org-jsonld-source] depends schema-dot-org-0.0.0.0-DK3bNdhkDmvFOAaebGqsq5
  197. 7.69 s [schema-dot-org-jsonld-source] depends tagsoup-0.14.8-BsqbPSEZh9W5mB1CzgSWho
  198. 7.69 s [schema-dot-org-jsonld-source] depends text-2.1.3-3f03
  199. 7.69 s [schema-dot-org-jsonld-source] depends vector-0.13.2.0-4sNODSde54Y5T3xVFmV0fE
  200. 7.69 s [schema-dot-org-jsonld-source] definite schema-dot-org-jsonld-0.0.0.0-Cu5ewoR91fM6pMI6cAFpDW-schema-dot-org-jsonld-test
  201. 7.69 s [schema-dot-org-jsonld-source] depends aeson-2.2.4.1-I5kgiCyiPJO8jEV0bEgUez
  202. 7.69 s [schema-dot-org-jsonld-source] depends base-4.20.2.0-4d66
  203. 7.69 s [schema-dot-org-jsonld-source] depends bytestring-0.12.2.0-25ef
  204. 7.69 s [schema-dot-org-jsonld-source] depends path-0.9.6-L3t3TcndY3P7bshtU9371n
  205. 7.69 s [schema-dot-org-jsonld-source] depends schema-dot-org-jsonld-0.0.0.0-IFXBqy7zHoeF7tncdo1uxB
  206. 7.69 s [schema-dot-org-jsonld-source] depends sydtest-0.20.0.1-Jo2KtBwwg0M2hH86LVxxcs
  207. 7.69 s [schema-dot-org-jsonld-source] depends sydtest-aeson-0.2.0.1-AEtebtKhgEIKIZK2rvdpfT
  208. 7.69 s [schema-dot-org-jsonld-source] Using Cabal-3.12.1.0 compiled by ghc-9.10
  209. 7.69 s [schema-dot-org-jsonld-source] Using compiler: ghc-9.10.3
  210. 7.69 s [schema-dot-org-jsonld-source] Using install prefix:
  211. 7.69 s [schema-dot-org-jsonld-source] /nix/store/hb3jb890fys3ax489w29v44nlv0nznpf-schema-dot-org-jsonld-source-0.0.0.0
  212. 7.69 s [schema-dot-org-jsonld-source] Executables installed in:
  213. 7.69 s [schema-dot-org-jsonld-source] /nix/store/hb3jb890fys3ax489w29v44nlv0nznpf-schema-dot-org-jsonld-source-0.0.0.0/bin
  214. 7.69 s [schema-dot-org-jsonld-source] Libraries installed in:
  215. 7.69 s [schema-dot-org-jsonld-source] /nix/store/hb3jb890fys3ax489w29v44nlv0nznpf-schema-dot-org-jsonld-source-0.0.0.0/lib/ghc-9.10.3/lib/x86_64-linux-ghc-9.10.3-21af/schema-dot-org-jsonld-0.0.0.0-IFXBqy7zHoeF7tncdo1uxB
  216. 7.69 s [schema-dot-org-jsonld-source] Dynamic Libraries installed in:
  217. 7.69 s [schema-dot-org-jsonld-source] /nix/store/hb3jb890fys3ax489w29v44nlv0nznpf-schema-dot-org-jsonld-source-0.0.0.0/lib/ghc-9.10.3/lib/x86_64-linux-ghc-9.10.3-21af
  218. 7.69 s [schema-dot-org-jsonld-source] Private executables installed in:
  219. 7.69 s [schema-dot-org-jsonld-source] /nix/store/hb3jb890fys3ax489w29v44nlv0nznpf-schema-dot-org-jsonld-source-0.0.0.0/libexec/x86_64-linux-ghc-9.10.3-21af/schema-dot-org-jsonld-0.0.0.0
  220. 7.69 s [schema-dot-org-jsonld-source] Data files installed in:
  221. 7.69 s [schema-dot-org-jsonld-source] /nix/store/hb3jb890fys3ax489w29v44nlv0nznpf-schema-dot-org-jsonld-source-0.0.0.0/share/x86_64-linux-ghc-9.10.3-21af/schema-dot-org-jsonld-0.0.0.0
  222. 7.69 s [schema-dot-org-jsonld-source] Documentation installed in: /share/doc/schema-dot-org-jsonld-0.0.0.0
  223. 7.69 s [schema-dot-org-jsonld-source] Configuration files installed in:
  224. 7.69 s [schema-dot-org-jsonld-source] /nix/store/hb3jb890fys3ax489w29v44nlv0nznpf-schema-dot-org-jsonld-source-0.0.0.0/etc
  225. 7.69 s [schema-dot-org-jsonld-source] No alex found
  226. 7.69 s [schema-dot-org-jsonld-source] Using ar found on system at:
  227. 7.69 s [schema-dot-org-jsonld-source] /nix/store/mbyy19mdwnfvfwmdi0gqgggx0njvpl1w-binutils-wrapper-2.46/bin/ar
  228. 7.69 s [schema-dot-org-jsonld-source] No c2hs found
  229. 7.69 s [schema-dot-org-jsonld-source] No cpphs found
  230. 7.69 s [schema-dot-org-jsonld-source] No doctest found
  231. 7.69 s [schema-dot-org-jsonld-source] Using gcc version 15.2.0 given by user at:
  232. 7.69 s [schema-dot-org-jsonld-source] /nix/store/788mx070y81zjlg5ipcl0cra3afviw9k-gcc-wrapper-15.2.0/bin/gcc
  233. 7.69 s [schema-dot-org-jsonld-source] Using ghc version 9.10.3 found on system at:
  234. 7.69 s [schema-dot-org-jsonld-source] /nix/store/k493jzz83044mqayvlb6247l35780kxy-ghc-9.10.3/bin/ghc
  235. 7.69 s [schema-dot-org-jsonld-source] Using ghc-pkg version 9.10.3 found on system at:
  236. 7.69 s [schema-dot-org-jsonld-source] /nix/store/k493jzz83044mqayvlb6247l35780kxy-ghc-9.10.3/bin/ghc-pkg-9.10.3
  237. 7.69 s [schema-dot-org-jsonld-source] No ghcjs found
  238. 7.69 s [schema-dot-org-jsonld-source] No ghcjs-pkg found
  239. 7.69 s [schema-dot-org-jsonld-source] No greencard found
  240. 7.69 s [schema-dot-org-jsonld-source] Using haddock version 2.31.1 found on system at:
  241. 7.69 s [schema-dot-org-jsonld-source] /nix/store/k493jzz83044mqayvlb6247l35780kxy-ghc-9.10.3/bin/haddock-ghc-9.10.3
  242. 7.69 s [schema-dot-org-jsonld-source] No happy found
  243. 7.69 s [schema-dot-org-jsonld-source] Using haskell-suite found on system at: haskell-suite-dummy-location
  244. 7.69 s [schema-dot-org-jsonld-source] Using haskell-suite-pkg found on system at: haskell-suite-pkg-dummy-location
  245. 7.69 s [schema-dot-org-jsonld-source] No hmake found
  246. 7.69 s [schema-dot-org-jsonld-source] Using hpc version 0.69 found on system at:
  247. 7.69 s [schema-dot-org-jsonld-source] /nix/store/k493jzz83044mqayvlb6247l35780kxy-ghc-9.10.3/bin/hpc-ghc-9.10.3
  248. 7.69 s [schema-dot-org-jsonld-source] Using hsc2hs version 0.68.10 found on system at:
  249. 7.69 s [schema-dot-org-jsonld-source] /nix/store/k493jzz83044mqayvlb6247l35780kxy-ghc-9.10.3/bin/hsc2hs-ghc-9.10.3
  250. 7.69 s [schema-dot-org-jsonld-source] Using hscolour version 1.25 found on system at:
  251. 7.69 s [schema-dot-org-jsonld-source] /nix/store/hvlf3xzdw0p5s3kybdkch6iqyz0740rc-hscolour-1.25/bin/HsColour
  252. 7.69 s [schema-dot-org-jsonld-source] No jhc found
  253. 7.69 s [schema-dot-org-jsonld-source] Using ld found on system at:
  254. 7.69 s [schema-dot-org-jsonld-source] /nix/store/788mx070y81zjlg5ipcl0cra3afviw9k-gcc-wrapper-15.2.0/bin/ld
  255. 7.69 s [schema-dot-org-jsonld-source] No pkg-config found
  256. 7.69 s [schema-dot-org-jsonld-source] Using runghc version 9.10.3 found on system at:
  257. 7.69 s [schema-dot-org-jsonld-source] /nix/store/k493jzz83044mqayvlb6247l35780kxy-ghc-9.10.3/bin/runghc-9.10.3
  258. 7.69 s [schema-dot-org-jsonld-source] Using strip version 2.46 found on system at:
  259. 7.69 s [schema-dot-org-jsonld-source] /nix/store/788mx070y81zjlg5ipcl0cra3afviw9k-gcc-wrapper-15.2.0/bin/strip
  260. 7.69 s [schema-dot-org-jsonld-source] Using tar found on system at:
  261. 7.69 s [schema-dot-org-jsonld-source] /nix/store/k5akwnrn9x2afaj2va7g4a2zpdim8l43-gnutar-1.35/bin/tar
  262. 7.69 s [schema-dot-org-jsonld-source] No uhc found
  263. 8.55 s [schema-dot-org-jsonld-source] Phase: buildPhase
  264. 8.59 s [schema-dot-org-jsonld-source] Distribution quality errors:
  265. 8.59 s [schema-dot-org-jsonld-source] [no-syn-desc] No 'synopsis' or 'description' field.
  266. 8.59 s [schema-dot-org-jsonld-source] [license-none] The 'license' field is missing or is NONE.
  267. 8.59 s [schema-dot-org-jsonld-source] Distribution quality warnings:
  268. 8.59 s [schema-dot-org-jsonld-source] [no-category] No 'category' field.
  269. 8.59 s [schema-dot-org-jsonld-source] [missing-upper-bounds] On library, these packages miss upper bounds:
  270. 8.59 s [schema-dot-org-jsonld-source] - aeson
  271. 8.59 s [schema-dot-org-jsonld-source] - bytestring
  272. 8.59 s [schema-dot-org-jsonld-source] - schema-dot-org
  273. 8.61 s [schema-dot-org-jsonld-source] - tagsoup
  274. 8.61 s [schema-dot-org-jsonld-source] - text
  275. 8.61 s [schema-dot-org-jsonld-source] - vector
  276. 8.61 s [schema-dot-org-jsonld-source] Please add them. There is more information at https://pvp.haskell.org/
  277. 8.61 s [schema-dot-org-jsonld-source] Note: the public hackage server would reject this package.
  278. 8.61 s [schema-dot-org-jsonld-source] Building source dist for schema-dot-org-jsonld-0.0.0.0...
  279. 8.66 s [schema-dot-org-jsonld-source] Source tarball created: dist/schema-dot-org-jsonld-0.0.0.0.tar.gz
  280. 8.67 s [schema-dot-org-jsonld-source] Phase: checkPhase
  281. 8.68 s [schema-dot-org-jsonld-source] Phase: haddockPhase
  282. 8.69 s [schema-dot-org-jsonld-source] Phase: installPhase
  283. 8.70 s [schema-dot-org-jsonld-source] Phase: fixupPhase
  284. 8.74 s [schema-dot-org-jsonld-source:post-build] Uploading to the NixCI staging cache: /nix/store/hb3jb890fys3ax489w29v44nlv0nznpf-schema-dot-org-jsonld-source-0.0.0.0
  285. 8.79 s [schema-dot-org-jsonld-source:post-build] warning: 'warn-short-path-literals' is deprecated, use 'lint-short-path-literals = ignore' instead
  286. 8.79 s [schema-dot-org-jsonld-source:post-build] copying 1 paths...
  287. 8.80 s [schema-dot-org-jsonld-source:post-build] copying path '/nix/store/hb3jb890fys3ax489w29v44nlv0nznpf-schema-dot-org-jsonld-source-0.0.0.0' to 'https://cache.staging.nix-ci.com'...
  288. 9.05 s [schema-dot-org-jsonld-source:post-build] warning: 'warn-short-path-literals' is deprecated, use 'lint-short-path-literals = ignore' instead
  289. 9.30 s [schema-dot-org-jsonld-source:post-build] copying 3 paths...
  290. 9.30 s [schema-dot-org-jsonld-source:post-build] copying path '/nix/store/i9l2iazgis2p4z8145vn5sdzy38rg1hw-schema-dot-org-jsonld' to 'https://cache.staging.nix-ci.com'...
  291. 9.30 s [schema-dot-org-jsonld-source:post-build] copying path '/nix/store/jrg2mlxpzcj7m6hd8wq6dmy7vjjgszfw-sydtest-aeson-0.2.0.1.drv' to 'https://cache.staging.nix-ci.com'...
  292. 10.03 s [schema-dot-org-jsonld-source:post-build] copying path '/nix/store/cvzwjiwmkmfp3v7s917ic2vl87zfvk8b-schema-dot-org-jsonld-source-0.0.0.0.drv' to 'https://cache.staging.nix-ci.com'...
  293. 10.31 s Uploaded schema-dot-org-jsonld-source in 1.5s
  294. 10.31 s Progress: 1 of 3 built, 40 of 40 downloaded from cache
  295. 10.31 s Built schema-dot-org-jsonld-source in 6.1s
  296. 10.36 s Building /nix/store/qb23a4nrh9wkz3rama8qa33vx26qma4h-schema-dot-org-jsonld-0.0.0.0.drv
  297. 10.71 s [schema-dot-org-jsonld] Phase: setupCompilerEnvironmentPhase
  298. 10.71 s [schema-dot-org-jsonld] Build with /nix/store/k493jzz83044mqayvlb6247l35780kxy-ghc-9.10.3.
  299. 11.55 s [schema-dot-org-jsonld] Phase: unpackPhase
  300. 11.56 s [schema-dot-org-jsonld] unpacking source archive /nix/store/hb3jb890fys3ax489w29v44nlv0nznpf-schema-dot-org-jsonld-source-0.0.0.0/schema-dot-org-jsonld-0.0.0.0.tar.gz
  301. 11.58 s [schema-dot-org-jsonld] source root is schema-dot-org-jsonld-0.0.0.0
  302. 11.60 s [schema-dot-org-jsonld] setting SOURCE_DATE_EPOCH to timestamp 1788907218 of file "schema-dot-org-jsonld-0.0.0.0/test/Spec.hs"
  303. 11.60 s [schema-dot-org-jsonld] warning: file "schema-dot-org-jsonld-0.0.0.0/test/Spec.hs" may be generated; SOURCE_DATE_EPOCH may be non-deterministic
  304. 11.61 s [schema-dot-org-jsonld] Phase: patchPhase
  305. 11.63 s [schema-dot-org-jsonld] Phase: compileBuildDriverPhase
  306. 11.64 s [schema-dot-org-jsonld] setupCompileFlags: -package-db=/build/tmp.b7iwZ6qPDo/setup-package.conf.d -threaded
  307. 11.70 s [schema-dot-org-jsonld] [1 of 2] Compiling Main ( Setup.hs, /build/tmp.b7iwZ6qPDo/Main.o )
  308. 11.75 s [schema-dot-org-jsonld] [2 of 2] Linking Setup
  309. 13.30 s [schema-dot-org-jsonld] Phase: updateAutotoolsGnuConfigScriptsPhase
  310. 13.33 s [schema-dot-org-jsonld] Phase: configurePhase
  311. 13.33 s [schema-dot-org-jsonld] configureFlags: --verbose --prefix=/nix/store/pyjksmcsnnf9vs7hcra9jzwjnaqma0sl-schema-dot-org-jsonld-0.0.0.0 --libdir=$prefix/lib/$compiler/lib --libsubdir=$abi/$libname --docdir=/nix/store/mkr5hhyxkfm26j37x6jlppv368518wjy-schema-dot-org-jsonld-0.0.0.0-doc/share/doc/schema-dot-org-jsonld-0.0.0.0 --with-gcc=gcc --package-db=/build/tmp.b7iwZ6qPDo/package.conf.d --ghc-option=-j14 --ghc-option=+RTS --ghc-option=-A64M --ghc-option=-RTS --enable-library-profiling --profiling-detail=exported-functions --disable-profiling --enable-shared --disable-coverage --enable-static --disable-executable-dynamic --enable-tests --disable-benchmarks --enable-library-vanilla --disable-library-for-ghci --enable-split-sections --enable-library-stripping --enable-executable-stripping --ghc-option=-haddock --ghc-option=-Wall --ghc-option=-Werror --extra-lib-dirs=/nix/store/wl2nw5l4x4dg6kclbgpq7v9212i1s6cy-ncurses-6.6/lib --extra-lib-dirs=/nix/store/2zs4bbi72plfm8j6zxf1js4f3yc4yzwy-libffi-3.5.2/lib --extra-lib-dirs=/nix/store/qhmqdg27kcrlkl8ida6d5hiacw0y8d21-elfutils-0.194/lib --extra-lib-dirs=/nix/store/y56aqb1m3y5davn6hsv4jfbml78qw4mv-gmp-with-cxx-6.3.0/lib --extra-lib-dirs=/nix/store/wjfhh11sfcdf97mvg7hbxickybxzk850-numactl-2.0.18/lib
  312. 13.35 s [schema-dot-org-jsonld] Using Parsec parser
  313. 13.35 s [schema-dot-org-jsonld] Configuring schema-dot-org-jsonld-0.0.0.0...
  314. 14.22 s [schema-dot-org-jsonld] Dependency aeson: using aeson-2.2.4.1
  315. 14.22 s [schema-dot-org-jsonld] Dependency base >=4.7 && <5: using base-4.20.2.0
  316. 14.22 s [schema-dot-org-jsonld] Dependency bytestring: using bytestring-0.12.2.0
  317. 14.22 s [schema-dot-org-jsonld] Dependency schema-dot-org: using schema-dot-org-0.0.0.0
  318. 14.22 s [schema-dot-org-jsonld] Dependency tagsoup: using tagsoup-0.14.8
  319. 14.22 s [schema-dot-org-jsonld] Dependency text: using text-2.1.3
  320. 14.23 s [schema-dot-org-jsonld] Dependency vector: using vector-0.13.2.0
  321. 14.23 s [schema-dot-org-jsonld] Dependency aeson: using aeson-2.2.4.1
  322. 14.23 s [schema-dot-org-jsonld] Dependency base >=4.7 && <5: using base-4.20.2.0
  323. 14.23 s [schema-dot-org-jsonld] Dependency bytestring: using bytestring-0.12.2.0
  324. 14.23 s [schema-dot-org-jsonld] Dependency path: using path-0.9.6
  325. 14.23 s [schema-dot-org-jsonld] Dependency schema-dot-org-jsonld: using schema-dot-org-jsonld-0.0.0.0
  326. 14.23 s [schema-dot-org-jsonld] Dependency sydtest: using sydtest-0.20.0.1
  327. 14.23 s [schema-dot-org-jsonld] Dependency sydtest-aeson: using sydtest-aeson-0.2.0.1
  328. 14.23 s [schema-dot-org-jsonld] Source component graph:
  329. 14.23 s [schema-dot-org-jsonld] component lib
  330. 14.23 s [schema-dot-org-jsonld] component test:schema-dot-org-jsonld-test dependency lib
  331. 14.23 s [schema-dot-org-jsonld] Configured component graph:
  332. 14.23 s [schema-dot-org-jsonld] component schema-dot-org-jsonld-0.0.0.0-IFXBqy7zHoeF7tncdo1uxB
  333. 14.23 s [schema-dot-org-jsonld] include aeson-2.2.4.1-I5kgiCyiPJO8jEV0bEgUez
  334. 14.23 s [schema-dot-org-jsonld] include base-4.20.2.0-4d66
  335. 14.23 s [schema-dot-org-jsonld] include bytestring-0.12.2.0-25ef
  336. 14.23 s [schema-dot-org-jsonld] include schema-dot-org-0.0.0.0-DK3bNdhkDmvFOAaebGqsq5
  337. 14.23 s [schema-dot-org-jsonld] include tagsoup-0.14.8-BsqbPSEZh9W5mB1CzgSWho
  338. 14.23 s [schema-dot-org-jsonld] include text-2.1.3-3f03
  339. 14.23 s [schema-dot-org-jsonld] include vector-0.13.2.0-4sNODSde54Y5T3xVFmV0fE
  340. 14.23 s [schema-dot-org-jsonld] component schema-dot-org-jsonld-0.0.0.0-Cu5ewoR91fM6pMI6cAFpDW-schema-dot-org-jsonld-test
  341. 14.23 s [schema-dot-org-jsonld] include aeson-2.2.4.1-I5kgiCyiPJO8jEV0bEgUez
  342. 14.23 s [schema-dot-org-jsonld] include base-4.20.2.0-4d66
  343. 14.23 s [schema-dot-org-jsonld] include bytestring-0.12.2.0-25ef
  344. 14.23 s [schema-dot-org-jsonld] include path-0.9.6-L3t3TcndY3P7bshtU9371n
  345. 14.23 s [schema-dot-org-jsonld] include schema-dot-org-jsonld-0.0.0.0-IFXBqy7zHoeF7tncdo1uxB
  346. 14.23 s [schema-dot-org-jsonld] include sydtest-0.20.0.1-Jo2KtBwwg0M2hH86LVxxcs
  347. 14.23 s [schema-dot-org-jsonld] include sydtest-aeson-0.2.0.1-AEtebtKhgEIKIZK2rvdpfT
  348. 14.23 s [schema-dot-org-jsonld] Linked component graph:
  349. 14.23 s [schema-dot-org-jsonld] unit schema-dot-org-jsonld-0.0.0.0-IFXBqy7zHoeF7tncdo1uxB
  350. 14.23 s [schema-dot-org-jsonld] include aeson-2.2.4.1-I5kgiCyiPJO8jEV0bEgUez
  351. 14.23 s [schema-dot-org-jsonld] include base-4.20.2.0-4d66
  352. 14.23 s [schema-dot-org-jsonld] include bytestring-0.12.2.0-25ef
  353. 14.23 s [schema-dot-org-jsonld] include schema-dot-org-0.0.0.0-DK3bNdhkDmvFOAaebGqsq5
  354. 14.23 s [schema-dot-org-jsonld] include tagsoup-0.14.8-BsqbPSEZh9W5mB1CzgSWho
  355. 14.23 s [schema-dot-org-jsonld] include text-2.1.3-3f03
  356. 14.23 s [schema-dot-org-jsonld] include vector-0.13.2.0-4sNODSde54Y5T3xVFmV0fE
  357. 14.23 s [schema-dot-org-jsonld] SchemaDotOrg.JSONLD=schema-dot-org-jsonld-0.0.0.0-IFXBqy7zHoeF7tncdo1uxB:SchemaDotOrg.JSONLD,SchemaDotOrg.JSONLD.Parse=schema-dot-org-jsonld-0.0.0.0-IFXBqy7zHoeF7tncdo1uxB:SchemaDotOrg.JSONLD.Parse,SchemaDotOrg.JSONLD.Render=schema-dot-org-jsonld-0.0.0.0-IFXBqy7zHoeF7tncdo1uxB:SchemaDotOrg.JSONLD.Render,SchemaDotOrg.JSONLD.Tagsoup=schema-dot-org-jsonld-0.0.0.0-IFXBqy7zHoeF7tncdo1uxB:SchemaDotOrg.JSONLD.Tagsoup
  358. 14.23 s [schema-dot-org-jsonld] unit schema-dot-org-jsonld-0.0.0.0-Cu5ewoR91fM6pMI6cAFpDW-schema-dot-org-jsonld-test
  359. 14.23 s [schema-dot-org-jsonld] include aeson-2.2.4.1-I5kgiCyiPJO8jEV0bEgUez
  360. 14.23 s [schema-dot-org-jsonld] include base-4.20.2.0-4d66
  361. 14.23 s [schema-dot-org-jsonld] include bytestring-0.12.2.0-25ef
  362. 14.23 s [schema-dot-org-jsonld] include path-0.9.6-L3t3TcndY3P7bshtU9371n
  363. 14.23 s [schema-dot-org-jsonld] include schema-dot-org-jsonld-0.0.0.0-IFXBqy7zHoeF7tncdo1uxB
  364. 14.23 s [schema-dot-org-jsonld] include sydtest-0.20.0.1-Jo2KtBwwg0M2hH86LVxxcs
  365. 14.23 s [schema-dot-org-jsonld] include sydtest-aeson-0.2.0.1-AEtebtKhgEIKIZK2rvdpfT
  366. 14.23 s [schema-dot-org-jsonld] Ready component graph:
  367. 14.23 s [schema-dot-org-jsonld] definite schema-dot-org-jsonld-0.0.0.0-IFXBqy7zHoeF7tncdo1uxB
  368. 14.23 s [schema-dot-org-jsonld] depends aeson-2.2.4.1-I5kgiCyiPJO8jEV0bEgUez
  369. 14.23 s [schema-dot-org-jsonld] depends base-4.20.2.0-4d66
  370. 14.23 s [schema-dot-org-jsonld] depends bytestring-0.12.2.0-25ef
  371. 14.23 s [schema-dot-org-jsonld] depends schema-dot-org-0.0.0.0-DK3bNdhkDmvFOAaebGqsq5
  372. 14.23 s [schema-dot-org-jsonld] depends tagsoup-0.14.8-BsqbPSEZh9W5mB1CzgSWho
  373. 14.23 s [schema-dot-org-jsonld] depends text-2.1.3-3f03
  374. 14.23 s [schema-dot-org-jsonld] depends vector-0.13.2.0-4sNODSde54Y5T3xVFmV0fE
  375. 14.23 s [schema-dot-org-jsonld] definite schema-dot-org-jsonld-0.0.0.0-Cu5ewoR91fM6pMI6cAFpDW-schema-dot-org-jsonld-test
  376. 14.23 s [schema-dot-org-jsonld] depends aeson-2.2.4.1-I5kgiCyiPJO8jEV0bEgUez
  377. 14.23 s [schema-dot-org-jsonld] depends base-4.20.2.0-4d66
  378. 14.23 s [schema-dot-org-jsonld] depends bytestring-0.12.2.0-25ef
  379. 14.23 s [schema-dot-org-jsonld] depends path-0.9.6-L3t3TcndY3P7bshtU9371n
  380. 14.23 s [schema-dot-org-jsonld] depends schema-dot-org-jsonld-0.0.0.0-IFXBqy7zHoeF7tncdo1uxB
  381. 14.23 s [schema-dot-org-jsonld] depends sydtest-0.20.0.1-Jo2KtBwwg0M2hH86LVxxcs
  382. 14.23 s [schema-dot-org-jsonld] depends sydtest-aeson-0.2.0.1-AEtebtKhgEIKIZK2rvdpfT
  383. 14.23 s [schema-dot-org-jsonld] Using Cabal-3.12.1.0 compiled by ghc-9.10
  384. 14.23 s [schema-dot-org-jsonld] Using compiler: ghc-9.10.3
  385. 14.23 s [schema-dot-org-jsonld] Using install prefix:
  386. 14.23 s [schema-dot-org-jsonld] /nix/store/pyjksmcsnnf9vs7hcra9jzwjnaqma0sl-schema-dot-org-jsonld-0.0.0.0
  387. 14.23 s [schema-dot-org-jsonld] Executables installed in:
  388. 14.23 s [schema-dot-org-jsonld] /nix/store/pyjksmcsnnf9vs7hcra9jzwjnaqma0sl-schema-dot-org-jsonld-0.0.0.0/bin
  389. 14.23 s [schema-dot-org-jsonld] Libraries installed in:
  390. 14.23 s [schema-dot-org-jsonld] /nix/store/pyjksmcsnnf9vs7hcra9jzwjnaqma0sl-schema-dot-org-jsonld-0.0.0.0/lib/ghc-9.10.3/lib/x86_64-linux-ghc-9.10.3-21af/schema-dot-org-jsonld-0.0.0.0-IFXBqy7zHoeF7tncdo1uxB
  391. 14.23 s [schema-dot-org-jsonld] Dynamic Libraries installed in:
  392. 14.23 s [schema-dot-org-jsonld] /nix/store/pyjksmcsnnf9vs7hcra9jzwjnaqma0sl-schema-dot-org-jsonld-0.0.0.0/lib/ghc-9.10.3/lib/x86_64-linux-ghc-9.10.3-21af
  393. 14.23 s [schema-dot-org-jsonld] Private executables installed in:
  394. 14.23 s [schema-dot-org-jsonld] /nix/store/pyjksmcsnnf9vs7hcra9jzwjnaqma0sl-schema-dot-org-jsonld-0.0.0.0/libexec/x86_64-linux-ghc-9.10.3-21af/schema-dot-org-jsonld-0.0.0.0
  395. 14.23 s [schema-dot-org-jsonld] Data files installed in:
  396. 14.23 s [schema-dot-org-jsonld] /nix/store/pyjksmcsnnf9vs7hcra9jzwjnaqma0sl-schema-dot-org-jsonld-0.0.0.0/share/x86_64-linux-ghc-9.10.3-21af/schema-dot-org-jsonld-0.0.0.0
  397. 14.23 s [schema-dot-org-jsonld] Documentation installed in:
  398. 14.23 s [schema-dot-org-jsonld] /nix/store/mkr5hhyxkfm26j37x6jlppv368518wjy-schema-dot-org-jsonld-0.0.0.0-doc/share/doc/schema-dot-org-jsonld-0.0.0.0
  399. 14.23 s [schema-dot-org-jsonld] Configuration files installed in:
  400. 14.23 s [schema-dot-org-jsonld] /nix/store/pyjksmcsnnf9vs7hcra9jzwjnaqma0sl-schema-dot-org-jsonld-0.0.0.0/etc
  401. 14.23 s [schema-dot-org-jsonld] No alex found
  402. 14.23 s [schema-dot-org-jsonld] Using ar found on system at:
  403. 14.23 s [schema-dot-org-jsonld] /nix/store/mbyy19mdwnfvfwmdi0gqgggx0njvpl1w-binutils-wrapper-2.46/bin/ar
  404. 14.23 s [schema-dot-org-jsonld] No c2hs found
  405. 14.23 s [schema-dot-org-jsonld] No cpphs found
  406. 14.23 s [schema-dot-org-jsonld] No doctest found
  407. 14.23 s [schema-dot-org-jsonld] Using gcc version 15.2.0 given by user at:
  408. 14.23 s [schema-dot-org-jsonld] /nix/store/788mx070y81zjlg5ipcl0cra3afviw9k-gcc-wrapper-15.2.0/bin/gcc
  409. 14.23 s [schema-dot-org-jsonld] Using ghc version 9.10.3 found on system at:
  410. 14.23 s [schema-dot-org-jsonld] /nix/store/k493jzz83044mqayvlb6247l35780kxy-ghc-9.10.3/bin/ghc
  411. 14.23 s [schema-dot-org-jsonld] Using ghc-pkg version 9.10.3 found on system at:
  412. 14.23 s [schema-dot-org-jsonld] /nix/store/k493jzz83044mqayvlb6247l35780kxy-ghc-9.10.3/bin/ghc-pkg-9.10.3
  413. 14.23 s [schema-dot-org-jsonld] No ghcjs found
  414. 14.23 s [schema-dot-org-jsonld] No ghcjs-pkg found
  415. 14.23 s [schema-dot-org-jsonld] No greencard found
  416. 14.23 s [schema-dot-org-jsonld] Using haddock version 2.31.1 found on system at:
  417. 14.23 s [schema-dot-org-jsonld] /nix/store/k493jzz83044mqayvlb6247l35780kxy-ghc-9.10.3/bin/haddock-ghc-9.10.3
  418. 14.23 s [schema-dot-org-jsonld] No happy found
  419. 14.23 s [schema-dot-org-jsonld] Using haskell-suite found on system at: haskell-suite-dummy-location
  420. 14.23 s [schema-dot-org-jsonld] Using haskell-suite-pkg found on system at: haskell-suite-pkg-dummy-location
  421. 14.23 s [schema-dot-org-jsonld] No hmake found
  422. 14.23 s [schema-dot-org-jsonld] Using hpc version 0.69 found on system at:
  423. 14.23 s [schema-dot-org-jsonld] /nix/store/k493jzz83044mqayvlb6247l35780kxy-ghc-9.10.3/bin/hpc-ghc-9.10.3
  424. 14.23 s [schema-dot-org-jsonld] Using hsc2hs version 0.68.10 found on system at:
  425. 14.23 s [schema-dot-org-jsonld] /nix/store/k493jzz83044mqayvlb6247l35780kxy-ghc-9.10.3/bin/hsc2hs-ghc-9.10.3
  426. 14.23 s [schema-dot-org-jsonld] Using hscolour version 1.25 found on system at:
  427. 14.23 s [schema-dot-org-jsonld] /nix/store/hvlf3xzdw0p5s3kybdkch6iqyz0740rc-hscolour-1.25/bin/HsColour
  428. 14.23 s [schema-dot-org-jsonld] No jhc found
  429. 14.23 s [schema-dot-org-jsonld] Using ld found on system at:
  430. 14.23 s [schema-dot-org-jsonld] /nix/store/788mx070y81zjlg5ipcl0cra3afviw9k-gcc-wrapper-15.2.0/bin/ld
  431. 14.23 s [schema-dot-org-jsonld] No pkg-config found
  432. 14.23 s [schema-dot-org-jsonld] Using runghc version 9.10.3 found on system at:
  433. 14.23 s [schema-dot-org-jsonld] /nix/store/k493jzz83044mqayvlb6247l35780kxy-ghc-9.10.3/bin/runghc-9.10.3
  434. 14.23 s [schema-dot-org-jsonld] Using strip version 2.46 found on system at:
  435. 14.23 s [schema-dot-org-jsonld] /nix/store/788mx070y81zjlg5ipcl0cra3afviw9k-gcc-wrapper-15.2.0/bin/strip
  436. 14.23 s [schema-dot-org-jsonld] Using tar found on system at:
  437. 14.23 s [schema-dot-org-jsonld] /nix/store/k5akwnrn9x2afaj2va7g4a2zpdim8l43-gnutar-1.35/bin/tar
  438. 14.23 s [schema-dot-org-jsonld] No uhc found
  439. 15.12 s [schema-dot-org-jsonld] Phase: buildPhase
  440. 15.20 s [schema-dot-org-jsonld] Preprocessing library for schema-dot-org-jsonld-0.0.0.0...
  441. 15.20 s [schema-dot-org-jsonld] Building library for schema-dot-org-jsonld-0.0.0.0...
  442. 15.32 s [schema-dot-org-jsonld] [1 of 5] Compiling Paths_schema_dot_org_jsonld ( dist/build/autogen/Paths_schema_dot_org_jsonld.hs, dist/build/Paths_schema_dot_org_jsonld.o, dist/build/Paths_schema_dot_org_jsonld.dyn_o )
  443. 15.51 s [schema-dot-org-jsonld] [2 of 5] Compiling SchemaDotOrg.JSONLD.Parse ( src/SchemaDotOrg/JSONLD/Parse.hs, dist/build/SchemaDotOrg/JSONLD/Parse.o, dist/build/SchemaDotOrg/JSONLD/Parse.dyn_o )
  444. 16.07 s [schema-dot-org-jsonld] [3 of 5] Compiling SchemaDotOrg.JSONLD.Render ( src/SchemaDotOrg/JSONLD/Render.hs, dist/build/SchemaDotOrg/JSONLD/Render.o, dist/build/SchemaDotOrg/JSONLD/Render.dyn_o )
  445. 16.07 s [schema-dot-org-jsonld] [4 of 5] Compiling SchemaDotOrg.JSONLD.Tagsoup ( src/SchemaDotOrg/JSONLD/Tagsoup.hs, dist/build/SchemaDotOrg/JSONLD/Tagsoup.o, dist/build/SchemaDotOrg/JSONLD/Tagsoup.dyn_o )
  446. 16.19 s [schema-dot-org-jsonld] [5 of 5] Compiling SchemaDotOrg.JSONLD ( src/SchemaDotOrg/JSONLD.hs, dist/build/SchemaDotOrg/JSONLD.o, dist/build/SchemaDotOrg/JSONLD.dyn_o )
  447. 16.50 s [schema-dot-org-jsonld] [1 of 5] Compiling Paths_schema_dot_org_jsonld ( dist/build/autogen/Paths_schema_dot_org_jsonld.hs, dist/build/Paths_schema_dot_org_jsonld.p_o )
  448. 16.80 s [schema-dot-org-jsonld] [2 of 5] Compiling SchemaDotOrg.JSONLD.Parse ( src/SchemaDotOrg/JSONLD/Parse.hs, dist/build/SchemaDotOrg/JSONLD/Parse.p_o )
  449. 17.30 s [schema-dot-org-jsonld] [3 of 5] Compiling SchemaDotOrg.JSONLD.Render ( src/SchemaDotOrg/JSONLD/Render.hs, dist/build/SchemaDotOrg/JSONLD/Render.p_o )
  450. 17.30 s [schema-dot-org-jsonld] [4 of 5] Compiling SchemaDotOrg.JSONLD.Tagsoup ( src/SchemaDotOrg/JSONLD/Tagsoup.hs, dist/build/SchemaDotOrg/JSONLD/Tagsoup.p_o )
  451. 17.40 s [schema-dot-org-jsonld] [5 of 5] Compiling SchemaDotOrg.JSONLD ( src/SchemaDotOrg/JSONLD.hs, dist/build/SchemaDotOrg/JSONLD.p_o )
  452. 19.50 s [schema-dot-org-jsonld] Preprocessing test suite 'schema-dot-org-jsonld-test' for schema-dot-org-jsonld-0.0.0.0...
  453. 19.50 s [schema-dot-org-jsonld] Building test suite 'schema-dot-org-jsonld-test' for schema-dot-org-jsonld-0.0.0.0...
  454. 19.61 s [schema-dot-org-jsonld] [1 of 3] Compiling Paths_schema_dot_org_jsonld ( dist/build/schema-dot-org-jsonld-test/autogen/Paths_schema_dot_org_jsonld.hs, dist/build/schema-dot-org-jsonld-test/schema-dot-org-jsonld-test-tmp/Paths_schema_dot_org_jsonld.o )
  455. 19.71 s [schema-dot-org-jsonld] [2 of 3] Compiling SchemaDotOrg.JSONLD.TagsoupSpec ( test/SchemaDotOrg/JSONLD/TagsoupSpec.hs, dist/build/schema-dot-org-jsonld-test/schema-dot-org-jsonld-test-tmp/SchemaDotOrg/JSONLD/TagsoupSpec.o )
  456. 19.77 s [schema-dot-org-jsonld] test/SchemaDotOrg/JSONLD/TagsoupSpec.hs:34:25: error: [GHC-83865]
  457. 19.77 s [schema-dot-org-jsonld] • Couldn't match type: Path.Internal.Posix.Path
  458. 19.77 s [schema-dot-org-jsonld] Path.Posix.Rel Path.Posix.Dir
  459. 19.77 s [schema-dot-org-jsonld] with: [Char]
  460. 19.77 s [schema-dot-org-jsonld] Expected: FilePath
  461. 19.77 s [schema-dot-org-jsonld] Actual: Path.Internal.Posix.Path Path.Posix.Rel Path.Posix.Dir
  462. 19.77 s [schema-dot-org-jsonld] • In the first argument of ‘scenarioDir’, namely
  463. 19.77 s [schema-dot-org-jsonld] ‘(Path.Internal.Posix.Path "test_resources/" ::
  464. 19.77 s [schema-dot-org-jsonld] Path.Internal.Posix.Path Path.Posix.Rel Path.Posix.Dir)’
  465. 19.77 s [schema-dot-org-jsonld] In the first argument of ‘($)’, namely
  466. 19.77 s [schema-dot-org-jsonld] ‘scenarioDir
  467. 19.77 s [schema-dot-org-jsonld] (Path.Internal.Posix.Path "test_resources/" ::
  468. 19.77 s [schema-dot-org-jsonld] Path.Internal.Posix.Path Path.Posix.Rel Path.Posix.Dir)’
  469. 19.77 s [schema-dot-org-jsonld] In the second argument of ‘($)’, namely
  470. 19.77 s [schema-dot-org-jsonld] ‘scenarioDir
  471. 19.77 s [schema-dot-org-jsonld] (Path.Internal.Posix.Path "test_resources/" ::
  472. 19.77 s [schema-dot-org-jsonld] Path.Internal.Posix.Path Path.Posix.Rel Path.Posix.Dir)
  473. 19.77 s [schema-dot-org-jsonld] $ \ file
  474. 19.77 s [schema-dot-org-jsonld] -> let fp = ...
  475. 19.77 s [schema-dot-org-jsonld] in when (".html" `isSuffixOf` fp) $ do it (unwords ...) $ ...’
  476. 19.77 s [schema-dot-org-jsonld] |
  477. 19.77 s [schema-dot-org-jsonld] 34 | scenarioDir [reldir|test_resources|] $ \file ->
  478. 19.77 s [schema-dot-org-jsonld] | ^^^^^^^^^^^^^^^^
  479. 19.77 s [schema-dot-org-jsonld]
  480. 19.77 s [schema-dot-org-jsonld] test/SchemaDotOrg/JSONLD/TagsoupSpec.hs:35:28: error: [GHC-83865]
  481. 19.77 s [schema-dot-org-jsonld] • Couldn't match type: [Char]
  482. 19.77 s [schema-dot-org-jsonld] with: Path.Internal.Posix.Path Path.Posix.Rel Path.Posix.File
  483. 19.77 s [schema-dot-org-jsonld] Expected: Path.Internal.Posix.Path Path.Posix.Rel Path.Posix.File
  484. 19.77 s [schema-dot-org-jsonld] Actual: FilePath
  485. 19.77 s [schema-dot-org-jsonld] • In the first argument of ‘fromRelFile’, namely ‘file’
  486. 19.77 s [schema-dot-org-jsonld] In the expression: fromRelFile file
  487. 19.77 s [schema-dot-org-jsonld] In an equation for ‘fp’: fp = fromRelFile file
  488. 19.77 s [schema-dot-org-jsonld] |
  489. 19.77 s [schema-dot-org-jsonld] 35 | let fp = fromRelFile file
  490. 19.77 s [schema-dot-org-jsonld] | ^^^^
  491. 19.77 s [schema-dot-org-jsonld]
  492. 20.03 s Progress: 1 of 2 built (1 failed), 40 of 40 downloaded from cache
  493. 20.03 s Failed to build schema-dot-org-jsonld after 9.6s
  494. 20.04 s Cannot build '/nix/store/qb23a4nrh9wkz3rama8qa33vx26qma4h-schema-dot-org-jsonld-0.0.0.0.drv'.
  495. 20.04 s Reason: builder failed with exit code 1.
  496. 20.04 s Output paths:
  497. 20.04 s /nix/store/mkr5hhyxkfm26j37x6jlppv368518wjy-schema-dot-org-jsonld-0.0.0.0-doc
  498. 20.04 s /nix/store/pyjksmcsnnf9vs7hcra9jzwjnaqma0sl-schema-dot-org-jsonld-0.0.0.0
  499. 20.04 s Last 195 log lines:
  500. 20.04 s > Running phase: setupCompilerEnvironmentPhase
  501. 20.04 s > Build with /nix/store/k493jzz83044mqayvlb6247l35780kxy-ghc-9.10.3.
  502. 20.04 s > Running phase: unpackPhase
  503. 20.04 s > unpacking source archive /nix/store/hb3jb890fys3ax489w29v44nlv0nznpf-schema-dot-org-jsonld-source-0.0.0.0/schema-dot-org-jsonld-0.0.0.0.tar.gz
  504. 20.04 s > source root is schema-dot-org-jsonld-0.0.0.0
  505. 20.04 s > setting SOURCE_DATE_EPOCH to timestamp 1788907218 of file "schema-dot-org-jsonld-0.0.0.0/test/Spec.hs"
  506. 20.04 s > warning: file "schema-dot-org-jsonld-0.0.0.0/test/Spec.hs" may be generated; SOURCE_DATE_EPOCH may be non-deterministic
  507. 20.04 s > Running phase: patchPhase
  508. 20.04 s > Running phase: compileBuildDriverPhase
  509. 20.04 s > setupCompileFlags: -package-db=/build/tmp.b7iwZ6qPDo/setup-package.conf.d -threaded
  510. 20.04 s > [1 of 2] Compiling Main ( Setup.hs, /build/tmp.b7iwZ6qPDo/Main.o )
  511. 20.04 s > [2 of 2] Linking Setup
  512. 20.04 s > Running phase: updateAutotoolsGnuConfigScriptsPhase
  513. 20.04 s > Running phase: configurePhase
  514. 20.04 s > configureFlags: --verbose --prefix=/nix/store/pyjksmcsnnf9vs7hcra9jzwjnaqma0sl-schema-dot-org-jsonld-0.0.0.0 --libdir=$prefix/lib/$compiler/lib --libsubdir=$abi/$libname --docdir=/nix/store/mkr5hhyxkfm26j37x6jlppv368518wjy-schema-dot-org-jsonld-0.0.0.0-doc/share/doc/schema-dot-org-jsonld-0.0.0.0 --with-gcc=gcc --package-db=/build/tmp.b7iwZ6qPDo/package.conf.d --ghc-option=-j14 --ghc-option=+RTS --ghc-option=-A64M --ghc-option=-RTS --enable-library-profiling --profiling-detail=exported-functions --disable-profiling --enable-shared --disable-coverage --enable-static --disable-executable-dynamic --enable-tests --disable-benchmarks --enable-library-vanilla --disable-library-for-ghci --enable-split-sections --enable-library-stripping --enable-executable-stripping --ghc-option=-haddock --ghc-option=-Wall --ghc-option=-Werror --extra-lib-dirs=/nix/store/wl2nw5l4x4dg6kclbgpq7v9212i1s6cy-ncurses-6.6/lib --extra-lib-dirs=/nix/store/2zs4bbi72plfm8j6zxf1js4f3yc4yzwy-libffi-3.5.2/lib --extra-lib-dirs=/nix/store/qhmqdg27kcrlkl8ida6d5hiacw0y8d21-elfutils-0.194/lib --extra-lib-dirs=/nix/store/y56aqb1m3y5davn6hsv4jfbml78qw4mv-gmp-with-cxx-6.3.0/lib --extra-lib-dirs=/nix/store/wjfhh11sfcdf97mvg7hbxickybxzk850-numactl-2.0.18/lib
  515. 20.04 s > Using Parsec parser
  516. 20.04 s > Configuring schema-dot-org-jsonld-0.0.0.0...
  517. 20.04 s > Dependency aeson: using aeson-2.2.4.1
  518. 20.04 s > Dependency base >=4.7 && <5: using base-4.20.2.0
  519. 20.04 s > Dependency bytestring: using bytestring-0.12.2.0
  520. 20.04 s > Dependency schema-dot-org: using schema-dot-org-0.0.0.0
  521. 20.04 s > Dependency tagsoup: using tagsoup-0.14.8
  522. 20.04 s > Dependency text: using text-2.1.3
  523. 20.04 s > Dependency vector: using vector-0.13.2.0
  524. 20.04 s > Dependency aeson: using aeson-2.2.4.1
  525. 20.04 s > Dependency base >=4.7 && <5: using base-4.20.2.0
  526. 20.04 s > Dependency bytestring: using bytestring-0.12.2.0
  527. 20.04 s > Dependency path: using path-0.9.6
  528. 20.04 s > Dependency schema-dot-org-jsonld: using schema-dot-org-jsonld-0.0.0.0
  529. 20.04 s > Dependency sydtest: using sydtest-0.20.0.1
  530. 20.04 s > Dependency sydtest-aeson: using sydtest-aeson-0.2.0.1
  531. 20.04 s > Source component graph:
  532. 20.04 s > component lib
  533. 20.04 s > component test:schema-dot-org-jsonld-test dependency lib
  534. 20.04 s > Configured component graph:
  535. 20.04 s > component schema-dot-org-jsonld-0.0.0.0-IFXBqy7zHoeF7tncdo1uxB
  536. 20.04 s > include aeson-2.2.4.1-I5kgiCyiPJO8jEV0bEgUez
  537. 20.04 s > include base-4.20.2.0-4d66
  538. 20.04 s > include bytestring-0.12.2.0-25ef
  539. 20.04 s > include schema-dot-org-0.0.0.0-DK3bNdhkDmvFOAaebGqsq5
  540. 20.04 s > include tagsoup-0.14.8-BsqbPSEZh9W5mB1CzgSWho
  541. 20.04 s > include text-2.1.3-3f03
  542. 20.04 s > include vector-0.13.2.0-4sNODSde54Y5T3xVFmV0fE
  543. 20.04 s > component schema-dot-org-jsonld-0.0.0.0-Cu5ewoR91fM6pMI6cAFpDW-schema-dot-org-jsonld-test
  544. 20.04 s > include aeson-2.2.4.1-I5kgiCyiPJO8jEV0bEgUez
  545. 20.04 s > include base-4.20.2.0-4d66
  546. 20.04 s > include bytestring-0.12.2.0-25ef
  547. 20.04 s > include path-0.9.6-L3t3TcndY3P7bshtU9371n
  548. 20.04 s > include schema-dot-org-jsonld-0.0.0.0-IFXBqy7zHoeF7tncdo1uxB
  549. 20.04 s > include sydtest-0.20.0.1-Jo2KtBwwg0M2hH86LVxxcs
  550. 20.04 s > include sydtest-aeson-0.2.0.1-AEtebtKhgEIKIZK2rvdpfT
  551. 20.04 s > Linked component graph:
  552. 20.04 s > unit schema-dot-org-jsonld-0.0.0.0-IFXBqy7zHoeF7tncdo1uxB
  553. 20.04 s > include aeson-2.2.4.1-I5kgiCyiPJO8jEV0bEgUez
  554. 20.04 s > include base-4.20.2.0-4d66
  555. 20.04 s > include bytestring-0.12.2.0-25ef
  556. 20.04 s > include schema-dot-org-0.0.0.0-DK3bNdhkDmvFOAaebGqsq5
  557. 20.04 s > include tagsoup-0.14.8-BsqbPSEZh9W5mB1CzgSWho
  558. 20.04 s > include text-2.1.3-3f03
  559. 20.04 s > include vector-0.13.2.0-4sNODSde54Y5T3xVFmV0fE
  560. 20.04 s > SchemaDotOrg.JSONLD=schema-dot-org-jsonld-0.0.0.0-IFXBqy7zHoeF7tncdo1uxB:SchemaDotOrg.JSONLD,SchemaDotOrg.JSONLD.Parse=schema-dot-org-jsonld-0.0.0.0-IFXBqy7zHoeF7tncdo1uxB:SchemaDotOrg.JSONLD.Parse,SchemaDotOrg.JSONLD.Render=schema-dot-org-jsonld-0.0.0.0-IFXBqy7zHoeF7tncdo1uxB:SchemaDotOrg.JSONLD.Render,SchemaDotOrg.JSONLD.Tagsoup=schema-dot-org-jsonld-0.0.0.0-IFXBqy7zHoeF7tncdo1uxB:SchemaDotOrg.JSONLD.Tagsoup
  561. 20.04 s > unit schema-dot-org-jsonld-0.0.0.0-Cu5ewoR91fM6pMI6cAFpDW-schema-dot-org-jsonld-test
  562. 20.04 s > include aeson-2.2.4.1-I5kgiCyiPJO8jEV0bEgUez
  563. 20.04 s > include base-4.20.2.0-4d66
  564. 20.04 s > include bytestring-0.12.2.0-25ef
  565. 20.04 s > include path-0.9.6-L3t3TcndY3P7bshtU9371n
  566. 20.04 s > include schema-dot-org-jsonld-0.0.0.0-IFXBqy7zHoeF7tncdo1uxB
  567. 20.04 s > include sydtest-0.20.0.1-Jo2KtBwwg0M2hH86LVxxcs
  568. 20.04 s > include sydtest-aeson-0.2.0.1-AEtebtKhgEIKIZK2rvdpfT
  569. 20.04 s > Ready component graph:
  570. 20.04 s > definite schema-dot-org-jsonld-0.0.0.0-IFXBqy7zHoeF7tncdo1uxB
  571. 20.04 s > depends aeson-2.2.4.1-I5kgiCyiPJO8jEV0bEgUez
  572. 20.04 s > depends base-4.20.2.0-4d66
  573. 20.04 s > depends bytestring-0.12.2.0-25ef
  574. 20.04 s > depends schema-dot-org-0.0.0.0-DK3bNdhkDmvFOAaebGqsq5
  575. 20.04 s > depends tagsoup-0.14.8-BsqbPSEZh9W5mB1CzgSWho
  576. 20.04 s > depends text-2.1.3-3f03
  577. 20.04 s > depends vector-0.13.2.0-4sNODSde54Y5T3xVFmV0fE
  578. 20.04 s > definite schema-dot-org-jsonld-0.0.0.0-Cu5ewoR91fM6pMI6cAFpDW-schema-dot-org-jsonld-test
  579. 20.04 s > depends aeson-2.2.4.1-I5kgiCyiPJO8jEV0bEgUez
  580. 20.04 s > depends base-4.20.2.0-4d66
  581. 20.04 s > depends bytestring-0.12.2.0-25ef
  582. 20.04 s > depends path-0.9.6-L3t3TcndY3P7bshtU9371n
  583. 20.04 s > depends schema-dot-org-jsonld-0.0.0.0-IFXBqy7zHoeF7tncdo1uxB
  584. 20.04 s > depends sydtest-0.20.0.1-Jo2KtBwwg0M2hH86LVxxcs
  585. 20.04 s > depends sydtest-aeson-0.2.0.1-AEtebtKhgEIKIZK2rvdpfT
  586. 20.04 s > Using Cabal-3.12.1.0 compiled by ghc-9.10
  587. 20.04 s > Using compiler: ghc-9.10.3
  588. 20.04 s > Using install prefix:
  589. 20.04 s > /nix/store/pyjksmcsnnf9vs7hcra9jzwjnaqma0sl-schema-dot-org-jsonld-0.0.0.0
  590. 20.04 s > Executables installed in:
  591. 20.04 s > /nix/store/pyjksmcsnnf9vs7hcra9jzwjnaqma0sl-schema-dot-org-jsonld-0.0.0.0/bin
  592. 20.04 s > Libraries installed in:
  593. 20.04 s > /nix/store/pyjksmcsnnf9vs7hcra9jzwjnaqma0sl-schema-dot-org-jsonld-0.0.0.0/lib/ghc-9.10.3/lib/x86_64-linux-ghc-9.10.3-21af/schema-dot-org-jsonld-0.0.0.0-IFXBqy7zHoeF7tncdo1uxB
  594. 20.04 s > Dynamic Libraries installed in:
  595. 20.04 s > /nix/store/pyjksmcsnnf9vs7hcra9jzwjnaqma0sl-schema-dot-org-jsonld-0.0.0.0/lib/ghc-9.10.3/lib/x86_64-linux-ghc-9.10.3-21af
  596. 20.04 s > Private executables installed in:
  597. 20.04 s > /nix/store/pyjksmcsnnf9vs7hcra9jzwjnaqma0sl-schema-dot-org-jsonld-0.0.0.0/libexec/x86_64-linux-ghc-9.10.3-21af/schema-dot-org-jsonld-0.0.0.0
  598. 20.04 s > Data files installed in:
  599. 20.04 s > /nix/store/pyjksmcsnnf9vs7hcra9jzwjnaqma0sl-schema-dot-org-jsonld-0.0.0.0/share/x86_64-linux-ghc-9.10.3-21af/schema-dot-org-jsonld-0.0.0.0
  600. 20.04 s > Documentation installed in:
  601. 20.04 s > /nix/store/mkr5hhyxkfm26j37x6jlppv368518wjy-schema-dot-org-jsonld-0.0.0.0-doc/share/doc/schema-dot-org-jsonld-0.0.0.0
  602. 20.04 s > Configuration files installed in:
  603. 20.04 s > /nix/store/pyjksmcsnnf9vs7hcra9jzwjnaqma0sl-schema-dot-org-jsonld-0.0.0.0/etc
  604. 20.04 s > No alex found
  605. 20.04 s > Using ar found on system at:
  606. 20.04 s > /nix/store/mbyy19mdwnfvfwmdi0gqgggx0njvpl1w-binutils-wrapper-2.46/bin/ar
  607. 20.04 s > No c2hs found
  608. 20.04 s > No cpphs found
  609. 20.04 s > No doctest found
  610. 20.04 s > Using gcc version 15.2.0 given by user at:
  611. 20.04 s > /nix/store/788mx070y81zjlg5ipcl0cra3afviw9k-gcc-wrapper-15.2.0/bin/gcc
  612. 20.04 s > Using ghc version 9.10.3 found on system at:
  613. 20.04 s > /nix/store/k493jzz83044mqayvlb6247l35780kxy-ghc-9.10.3/bin/ghc
  614. 20.04 s > Using ghc-pkg version 9.10.3 found on system at:
  615. 20.04 s > /nix/store/k493jzz83044mqayvlb6247l35780kxy-ghc-9.10.3/bin/ghc-pkg-9.10.3
  616. 20.04 s > No ghcjs found
  617. 20.04 s > No ghcjs-pkg found
  618. 20.04 s > No greencard found
  619. 20.04 s > Using haddock version 2.31.1 found on system at:
  620. 20.04 s > /nix/store/k493jzz83044mqayvlb6247l35780kxy-ghc-9.10.3/bin/haddock-ghc-9.10.3
  621. 20.04 s > No happy found
  622. 20.04 s > Using haskell-suite found on system at: haskell-suite-dummy-location
  623. 20.04 s > Using haskell-suite-pkg found on system at: haskell-suite-pkg-dummy-location
  624. 20.04 s > No hmake found
  625. 20.04 s > Using hpc version 0.69 found on system at:
  626. 20.04 s > /nix/store/k493jzz83044mqayvlb6247l35780kxy-ghc-9.10.3/bin/hpc-ghc-9.10.3
  627. 20.04 s > Using hsc2hs version 0.68.10 found on system at:
  628. 20.04 s > /nix/store/k493jzz83044mqayvlb6247l35780kxy-ghc-9.10.3/bin/hsc2hs-ghc-9.10.3
  629. 20.04 s > Using hscolour version 1.25 found on system at:
  630. 20.04 s > /nix/store/hvlf3xzdw0p5s3kybdkch6iqyz0740rc-hscolour-1.25/bin/HsColour
  631. 20.04 s > No jhc found
  632. 20.04 s > Using ld found on system at:
  633. 20.04 s > /nix/store/788mx070y81zjlg5ipcl0cra3afviw9k-gcc-wrapper-15.2.0/bin/ld
  634. 20.04 s > No pkg-config found
  635. 20.04 s > Using runghc version 9.10.3 found on system at:
  636. 20.04 s > /nix/store/k493jzz83044mqayvlb6247l35780kxy-ghc-9.10.3/bin/runghc-9.10.3
  637. 20.04 s > Using strip version 2.46 found on system at:
  638. 20.04 s > /nix/store/788mx070y81zjlg5ipcl0cra3afviw9k-gcc-wrapper-15.2.0/bin/strip
  639. 20.04 s > Using tar found on system at:
  640. 20.04 s > /nix/store/k5akwnrn9x2afaj2va7g4a2zpdim8l43-gnutar-1.35/bin/tar
  641. 20.04 s > No uhc found
  642. 20.04 s > Running phase: buildPhase
  643. 20.04 s > Preprocessing library for schema-dot-org-jsonld-0.0.0.0...
  644. 20.04 s > Building library for schema-dot-org-jsonld-0.0.0.0...
  645. 20.04 s > [1 of 5] Compiling Paths_schema_dot_org_jsonld ( dist/build/autogen/Paths_schema_dot_org_jsonld.hs, dist/build/Paths_schema_dot_org_jsonld.o, dist/build/Paths_schema_dot_org_jsonld.dyn_o )
  646. 20.04 s > [2 of 5] Compiling SchemaDotOrg.JSONLD.Parse ( src/SchemaDotOrg/JSONLD/Parse.hs, dist/build/SchemaDotOrg/JSONLD/Parse.o, dist/build/SchemaDotOrg/JSONLD/Parse.dyn_o )
  647. 20.04 s > [3 of 5] Compiling SchemaDotOrg.JSONLD.Render ( src/SchemaDotOrg/JSONLD/Render.hs, dist/build/SchemaDotOrg/JSONLD/Render.o, dist/build/SchemaDotOrg/JSONLD/Render.dyn_o )
  648. 20.04 s > [4 of 5] Compiling SchemaDotOrg.JSONLD.Tagsoup ( src/SchemaDotOrg/JSONLD/Tagsoup.hs, dist/build/SchemaDotOrg/JSONLD/Tagsoup.o, dist/build/SchemaDotOrg/JSONLD/Tagsoup.dyn_o )
  649. 20.04 s > [5 of 5] Compiling SchemaDotOrg.JSONLD ( src/SchemaDotOrg/JSONLD.hs, dist/build/SchemaDotOrg/JSONLD.o, dist/build/SchemaDotOrg/JSONLD.dyn_o )
  650. 20.04 s > [1 of 5] Compiling Paths_schema_dot_org_jsonld ( dist/build/autogen/Paths_schema_dot_org_jsonld.hs, dist/build/Paths_schema_dot_org_jsonld.p_o )
  651. 20.04 s > [2 of 5] Compiling SchemaDotOrg.JSONLD.Parse ( src/SchemaDotOrg/JSONLD/Parse.hs, dist/build/SchemaDotOrg/JSONLD/Parse.p_o )
  652. 20.04 s > [3 of 5] Compiling SchemaDotOrg.JSONLD.Render ( src/SchemaDotOrg/JSONLD/Render.hs, dist/build/SchemaDotOrg/JSONLD/Render.p_o )
  653. 20.04 s > [4 of 5] Compiling SchemaDotOrg.JSONLD.Tagsoup ( src/SchemaDotOrg/JSONLD/Tagsoup.hs, dist/build/SchemaDotOrg/JSONLD/Tagsoup.p_o )
  654. 20.04 s > [5 of 5] Compiling SchemaDotOrg.JSONLD ( src/SchemaDotOrg/JSONLD.hs, dist/build/SchemaDotOrg/JSONLD.p_o )
  655. 20.04 s > Preprocessing test suite 'schema-dot-org-jsonld-test' for schema-dot-org-jsonld-0.0.0.0...
  656. 20.04 s > Building test suite 'schema-dot-org-jsonld-test' for schema-dot-org-jsonld-0.0.0.0...
  657. 20.04 s > [1 of 3] Compiling Paths_schema_dot_org_jsonld ( dist/build/schema-dot-org-jsonld-test/autogen/Paths_schema_dot_org_jsonld.hs, dist/build/schema-dot-org-jsonld-test/schema-dot-org-jsonld-test-tmp/Paths_schema_dot_org_jsonld.o )
  658. 20.04 s > [2 of 3] Compiling SchemaDotOrg.JSONLD.TagsoupSpec ( test/SchemaDotOrg/JSONLD/TagsoupSpec.hs, dist/build/schema-dot-org-jsonld-test/schema-dot-org-jsonld-test-tmp/SchemaDotOrg/JSONLD/TagsoupSpec.o )
  659. 20.04 s > test/SchemaDotOrg/JSONLD/TagsoupSpec.hs:34:25: error: [GHC-83865]
  660. 20.04 s > • Couldn't match type: Path.Internal.Posix.Path
  661. 20.04 s > Path.Posix.Rel Path.Posix.Dir
  662. 20.04 s > with: [Char]
  663. 20.04 s > Expected: FilePath
  664. 20.04 s > Actual: Path.Internal.Posix.Path Path.Posix.Rel Path.Posix.Dir
  665. 20.04 s > • In the first argument of ‘scenarioDir’, namely
  666. 20.04 s > ‘(Path.Internal.Posix.Path "test_resources/" ::
  667. 20.04 s > Path.Internal.Posix.Path Path.Posix.Rel Path.Posix.Dir)’
  668. 20.04 s > In the first argument of ‘($)’, namely
  669. 20.04 s > ‘scenarioDir
  670. 20.04 s > (Path.Internal.Posix.Path "test_resources/" ::
  671. 20.04 s > Path.Internal.Posix.Path Path.Posix.Rel Path.Posix.Dir)’
  672. 20.04 s > In the second argument of ‘($)’, namely
  673. 20.04 s > ‘scenarioDir
  674. 20.04 s > (Path.Internal.Posix.Path "test_resources/" ::
  675. 20.04 s > Path.Internal.Posix.Path Path.Posix.Rel Path.Posix.Dir)
  676. 20.04 s > $ \ file
  677. 20.04 s > -> let fp = ...
  678. 20.04 s > in when (".html" `isSuffixOf` fp) $ do it (unwords ...) $ ...’
  679. 20.04 s > |
  680. 20.04 s > 34 | scenarioDir [reldir|test_resources|] $ \file ->
  681. 20.04 s > | ^^^^^^^^^^^^^^^^
  682. 20.04 s >
  683. 20.04 s > test/SchemaDotOrg/JSONLD/TagsoupSpec.hs:35:28: error: [GHC-83865]
  684. 20.04 s > • Couldn't match type: [Char]
  685. 20.04 s > with: Path.Internal.Posix.Path Path.Posix.Rel Path.Posix.File
  686. 20.04 s > Expected: Path.Internal.Posix.Path Path.Posix.Rel Path.Posix.File
  687. 20.04 s > Actual: FilePath
  688. 20.04 s > • In the first argument of ‘fromRelFile’, namely ‘file’
  689. 20.04 s > In the expression: fromRelFile file
  690. 20.04 s > In an equation for ‘fp’: fp = fromRelFile file
  691. 20.04 s > |
  692. 20.04 s > 35 | let fp = fromRelFile file
  693. 20.04 s > | ^^^^
  694. 20.04 s >
  695. 20.04 s For full logs, run:
  696. 20.04 s nix log /nix/store/qb23a4nrh9wkz3rama8qa33vx26qma4h-schema-dot-org-jsonld-0.0.0.0.drv
  697. 20.07 s Build failed.