build packages.x86_64-linux.jsonld

Queued Started Finished

Reproduce this run
Retry Run
  1. 0.00 s $ /nix/store/9ypz3flqsrl5xl495mm8h645gadjsxi1-coreutils-9.11/bin/timeout --kill-after=15s 7200s /nix/store/23zk8sgzamrbmj1fday15szf7f2279s8-nix-2.34.7/bin/nix --extra-experimental-features nix-command --extra-experimental-features flakes --log-format internal-json build --no-link --print-out-paths git+https://github.com/NorfairKing/schema-dot-org?ref=typed-scenario-paths&rev=d9ffa90ad3a770891245de7773a9c3d589047622&shallow=1#packages.x86_64-linux.jsonld --print-build-logs
  2. 0.08 s fetching Git repository 'https://github.com/NorfairKing/schema-dot-org'
  3. 0.64 s remote: Enumerating objects: 94, done.
  4. 0.64 s remote: Counting objects: 1% (1/94) remote: Counting objects: 2% (2/94) remote: Counting objects: 3% (3/94) remote: Counting objects: 4% (4/94) remote: Counting objects: 5% (5/94) remote: Counting objects: 6% (6/94) remote: Counting objects: 7% (7/94) remote: Counting objects: 8% (8/94) remote: Counting objects: 9% (9/94) remote: Counting objects: 10% (10/94) remote: Counting objects: 11% (11/94) remote: Counting objects: 12% (12/94) remote: Counting objects: 13% (13/94) remote: Counting objects: 14% (14/94) remote: Counting objects: 15% (15/94) remote: Counting objects: 17% (16/94) remote: Counting objects: 18% (17/94) remote: Counting objects: 19% (18/94) remote: Counting objects: 20% (19/94) remote: Counting objects: 21% (20/94) remote: Counting objects: 22% (21/94) remote: Counting objects: 23% (22/94) remote: Counting objects: 24% (23/94) remote: Counting objects: 25% (24/94) remote: Counting objects: 26% (25/94) remote: Counting objects: 27% (26/94) remote: Counting objects: 28% (27/94) remote: Counting objects: 29% (28/94) remote: Counting objects: 30% (29/94) remote: Counting objects: 31% (30/94) remote: Counting objects: 32% (31/94) remote: Counting objects: 34% (32/94) remote: Counting objects: 35% (33/94) remote: Counting objects: 36% (34/94) remote: Counting objects: 37% (35/94) remote: Counting objects: 38% (36/94) remote: Counting objects: 39% (37/94) remote: Counting objects: 40% (38/94) remote: Counting objects: 41% (39/94) remote: Counting objects: 42% (40/94) remote: Counting objects: 43% (41/94) remote: Counting objects: 44% (42/94) remote: Counting objects: 45% (43/94) remote: Counting objects: 46% (44/94) remote: Counting objects: 47% (45/94) remote: Counting objects: 48% (46/94) remote: Counting objects: 50% (47/94) remote: Counting objects: 51% (48/94) remote: Counting objects: 52% (49/94) remote: Counting objects: 53% (50/94) remote: Counting objects: 54% (51/94) remote: Counting objects: 55% (52/94) remote: Counting objects: 56% (53/94) remote: Counting objects: 57% (54/94) remote: Counting objects: 58% (55/94) remote: Counting objects: 59% (56/94) remote: Counting objects: 60% (57/94) remote: Counting objects: 61% (58/94) remote: Counting objects: 62% (59/94) remote: Counting objects: 63% (60/94) remote: Counting objects: 64% (61/94) remote: Counting objects: 65% (62/94) remote: Counting objects: 67% (63/94) remote: Counting objects: 68% (64/94) remote: Counting objects: 69% (65/94) remote: Counting objects: 70% (66/94) remote: Counting objects: 71% (67/94) remote: Counting objects: 72% (68/94) remote: Counting objects: 73% (69/94) remote: Counting objects: 74% (70/94) remote: Counting objects: 75% (71/94) remote: Counting objects: 76% (72/94) remote: Counting objects: 77% (73/94) remote: Counting objects: 78% (74/94) remote: Counting objects: 79% (75/94) remote: Counting objects: 80% (76/94) remote: Counting objects: 81% (77/94) remote: Counting objects: 82% (78/94) remote: Counting objects: 84% (79/94) remote: Counting objects: 85% (80/94) remote: Counting objects: 86% (81/94) remote: Counting objects: 87% (82/94) remote: Counting objects: 88% (83/94) remote: Counting objects: 89% (84/94) remote: Counting objects: 90% (85/94) remote: Counting objects: 91% (86/94) remote: Counting objects: 92% (87/94) remote: Counting objects: 93% (88/94) remote: Counting objects: 94% (89/94) remote: Counting objects: 95% (90/94) remote: Counting objects: 96% (91/94) remote: Counting objects: 97% (92/94) remote: Counting objects: 98% (93/94) remote: Counting objects: 100% (94/94) remote: Counting objects: 100% (94/94), done.
  5. 0.64 s remote: Compressing objects: 1% (1/78) remote: Compressing objects: 2% (2/78) remote: Compressing objects: 3% (3/78) remote: Compressing objects: 5% (4/78) remote: Compressing objects: 6% (5/78) remote: Compressing objects: 7% (6/78) remote: Compressing objects: 8% (7/78) remote: Compressing objects: 10% (8/78) remote: Compressing objects: 11% (9/78) remote: Compressing objects: 12% (10/78) remote: Compressing objects: 14% (11/78) remote: Compressing objects: 15% (12/78) remote: Compressing objects: 16% (13/78) remote: Compressing objects: 17% (14/78) remote: Compressing objects: 19% (15/78) remote: Compressing objects: 20% (16/78) remote: Compressing objects: 21% (17/78) remote: Compressing objects: 23% (18/78) remote: Compressing objects: 24% (19/78) remote: Compressing objects: 25% (20/78) remote: Compressing objects: 26% (21/78) remote: Compressing objects: 28% (22/78) remote: Compressing objects: 29% (23/78) remote: Compressing objects: 30% (24/78) remote: Compressing objects: 32% (25/78) remote: Compressing objects: 33% (26/78) remote: Compressing objects: 34% (27/78) remote: Compressing objects: 35% (28/78) remote: Compressing objects: 37% (29/78) remote: Compressing objects: 38% (30/78) remote: Compressing objects: 39% (31/78) remote: Compressing objects: 41% (32/78) remote: Compressing objects: 42% (33/78) remote: Compressing objects: 43% (34/78) remote: Compressing objects: 44% (35/78) remote: Compressing objects: 46% (36/78) remote: Compressing objects: 47% (37/78) remote: Compressing objects: 48% (38/78) remote: Compressing objects: 50% (39/78) remote: Compressing objects: 51% (40/78) remote: Compressing objects: 52% (41/78) remote: Compressing objects: 53% (42/78) remote: Compressing objects: 55% (43/78) remote: Compressing objects: 56% (44/78) remote: Compressing objects: 57% (45/78) remote: Compressing objects: 58% (46/78) remote: Compressing objects: 60% (47/78) remote: Compressing objects: 61% (48/78) remote: Compressing objects: 62% (49/78) remote: Compressing objects: 64% (50/78) remote: Compressing objects: 65% (51/78) remote: Compressing objects: 66% (52/78) remote: Compressing objects: 67% (53/78) remote: Compressing objects: 69% (54/78) remote: Compressing objects: 70% (55/78) remote: Compressing objects: 71% (56/78) remote: Compressing objects: 73% (57/78) remote: Compressing objects: 74% (58/78) remote: Compressing objects: 75% (59/78) remote: Compressing objects: 76% (60/78) remote: Compressing objects: 78% (61/78) remote: Compressing objects: 79% (62/78) remote: Compressing objects: 80% (63/78) remote: Compressing objects: 82% (64/78) remote: Compressing objects: 83% (65/78) remote: Compressing objects: 84% (66/78) remote: Compressing objects: 85% (67/78) remote: Compressing objects: 87% (68/78) remote: Compressing objects: 88% (69/78) remote: Compressing objects: 89% (70/78) remote: Compressing objects: 91% (71/78) remote: Compressing objects: 92% (72/78) remote: Compressing objects: 93% (73/78) remote: Compressing objects: 94% (74/78) remote: Compressing objects: 96% (75/78) remote: Compressing objects: 97% (76/78) remote: Compressing objects: 98% (77/78) remote: Compressing objects: 100% (78/78) remote: Compressing objects: 100% (78/78), done.
  6. 0.66 s Unpacking objects: 1% (1/94) Unpacking objects: 2% (2/94) Unpacking objects: 3% (3/94) Unpacking objects: 4% (4/94) Unpacking objects: 5% (5/94) Unpacking objects: 6% (6/94) Unpacking objects: 7% (7/94) Unpacking objects: 8% (8/94) Unpacking objects: 9% (9/94) Unpacking objects: 10% (10/94) Unpacking objects: 11% (11/94) Unpacking objects: 12% (12/94) Unpacking objects: 13% (13/94) Unpacking objects: 14% (14/94) Unpacking objects: 15% (15/94) Unpacking objects: 17% (16/94) Unpacking objects: 18% (17/94) Unpacking objects: 19% (18/94) Unpacking objects: 20% (19/94) Unpacking objects: 21% (20/94) Unpacking objects: 22% (21/94) Unpacking objects: 23% (22/94) Unpacking objects: 24% (23/94) Unpacking objects: 25% (24/94) Unpacking objects: 26% (25/94) Unpacking objects: 27% (26/94) Unpacking objects: 28% (27/94) Unpacking objects: 29% (28/94) Unpacking objects: 30% (29/94) Unpacking objects: 31% (30/94) Unpacking objects: 32% (31/94) Unpacking objects: 34% (32/94) Unpacking objects: 35% (33/94) Unpacking objects: 36% (34/94) Unpacking objects: 37% (35/94) Unpacking objects: 38% (36/94) Unpacking objects: 39% (37/94) Unpacking objects: 40% (38/94) Unpacking objects: 41% (39/94) Unpacking objects: 42% (40/94) Unpacking objects: 43% (41/94) Unpacking objects: 44% (42/94) Unpacking objects: 45% (43/94) Unpacking objects: 46% (44/94) Unpacking objects: 47% (45/94) Unpacking objects: 48% (46/94) Unpacking objects: 50% (47/94) Unpacking objects: 51% (48/94) Unpacking objects: 52% (49/94) Unpacking objects: 53% (50/94) Unpacking objects: 54% (51/94) Unpacking objects: 55% (52/94) Unpacking objects: 56% (53/94) Unpacking objects: 57% (54/94) Unpacking objects: 58% (55/94) Unpacking objects: 59% (56/94) Unpacking objects: 60% (57/94) Unpacking objects: 61% (58/94) Unpacking objects: 62% (59/94) Unpacking objects: 63% (60/94) Unpacking objects: 64% (61/94) Unpacking objects: 65% (62/94) Unpacking objects: 67% (63/94) Unpacking objects: 68% (64/94) Unpacking objects: 69% (65/94) Unpacking objects: 70% (66/94) Unpacking objects: 71% (67/94) Unpacking objects: 72% (68/94) Unpacking objects: 73% (69/94) Unpacking objects: 74% (70/94) Unpacking objects: 75% (71/94) Unpacking objects: 76% (72/94) Unpacking objects: 77% (73/94) Unpacking objects: 78% (74/94) Unpacking objects: 79% (75/94) Unpacking objects: 80% (76/94) Unpacking objects: 81% (77/94) Unpacking objects: 82% (78/94) Unpacking objects: 84% (79/94) Unpacking objects: 85% (80/94) Unpacking objects: 86% (81/94) Unpacking objects: 87% (82/94) Unpacking objects: 88% (83/94) Unpacking objects: 89% (84/94) Unpacking objects: 90% (85/94) Unpacking objects: 91% (86/94) Unpacking objects: 92% (87/94) Unpacking objects: 93% (88/94) Unpacking objects: 94% (89/94) Unpacking objects: 95% (90/94) remote: Total 94 (delta 4), reused 60 (delta 1), pack-reused 0 (from 0)
  7. 0.67 s Unpacking objects: 96% (91/94) Unpacking objects: 97% (92/94) Unpacking objects: 98% (93/94) Unpacking objects: 100% (94/94) Unpacking objects: 100% (94/94), 116.33 KiB | 6.12 MiB/s, done.
  8. 0.67 s From https://github.com/NorfairKing/schema-dot-org
  9. 0.67 s * branch d9ffa90ad3a770891245de7773a9c3d589047622 -> FETCH_HEAD
  10. 0.71 s error (ignored): SQLite database '/var/cache/nix-ci-worker/eval-cache-v6/5296da4b15cd05c3919ab41980f4084ac8b5700bf22003971b42e5797862cead.sqlite' is busy
  11. 1.98 s
  12. 5.71 s Downloading cached sydtest-discover-0.0.0.4-doc from https://cache.staging.nix-ci.com
  13. 5.71 s Downloading cached validity-0.12.1.0-doc from https://cache.staging.nix-ci.com
  14. 5.71 s Downloading cached fast-myers-diff-0.0.1-doc from https://cache.staging.nix-ci.com
  15. 9.47 s Downloaded cached sydtest-discover-0.0.0.4-doc (282 KiB) in 3.7s
  16. 9.47 s Progress: 0 of 5 built, 1 of 40 downloaded from cache (2 downloading)
  17. 9.48 s Downloading cached sydtest-discover from https://cache.staging.nix-ci.com
  18. 10.24 s Downloaded cached validity-0.12.1.0-doc (849 KiB) in 4.5s
  19. 10.24 s Progress: 0 of 5 built, 2 of 40 downloaded from cache (2 downloading)
  20. 10.24 s Downloading cached validity from https://cache.staging.nix-ci.com
  21. 10.24 s Downloading cached validity-bytestring-0.4.1.1-doc from https://cache.staging.nix-ci.com
  22. 10.24 s Downloading cached validity-containers-0.5.0.5-doc from https://cache.staging.nix-ci.com
  23. 10.24 s Downloading cached validity-scientific-0.2.0.3-doc from https://cache.staging.nix-ci.com
  24. 10.24 s Downloading cached validity-text-0.3.1.3-doc from https://cache.staging.nix-ci.com
  25. 10.24 s Downloading cached validity-unordered-containers-0.2.0.3-doc from https://cache.staging.nix-ci.com
  26. 10.24 s Downloading cached validity-vector-0.2.0.3-doc from https://cache.staging.nix-ci.com
  27. 10.28 s Downloaded cached fast-myers-diff-0.0.1-doc (497 KiB) in 4.5s
  28. 10.28 s Progress: 0 of 5 built, 3 of 40 downloaded from cache (8 downloading)
  29. 10.28 s Downloading cached fast-myers-diff from https://cache.staging.nix-ci.com
  30. 13.01 s Downloaded cached validity-containers-0.5.0.5-doc (218 KiB) in 2.7s
  31. 13.01 s Progress: 0 of 5 built, 4 of 40 downloaded from cache (8 downloading)
  32. 13.02 s Downloaded cached validity-bytestring-0.4.1.1-doc (162 KiB) in 2.7s
  33. 13.02 s Progress: 0 of 5 built, 5 of 40 downloaded from cache (7 downloading)
  34. 13.03 s Downloaded cached validity-scientific-0.2.0.3-doc (146 KiB) in 2.7s
  35. 13.03 s Progress: 0 of 5 built, 6 of 40 downloaded from cache (6 downloading)
  36. 13.03 s Downloading cached autodocodec-0.5.0.0-doc from https://cache.staging.nix-ci.com
  37. 13.03 s Downloaded cached validity-vector-0.2.0.3-doc (155 KiB) in 2.7s
  38. 13.03 s Progress: 0 of 5 built, 7 of 40 downloaded from cache (6 downloading)
  39. 13.03 s Downloaded cached validity-text-0.3.1.3-doc (184 KiB) in 2.7s
  40. 13.03 s Progress: 0 of 5 built, 8 of 40 downloaded from cache (5 downloading)
  41. 13.03 s Downloading cached safe-coloured-text-0.3.0.2-doc from https://cache.staging.nix-ci.com
  42. 13.03 s Downloaded cached safe-coloured-text-0.3.0.2-doc in 0ms
  43. 13.03 s Progress: 0 of 5 built, 9 of 40 downloaded from cache (5 downloading)
  44. 13.03 s Downloading cached safe-coloured-text-layout-0.2.0.1-doc from https://cache.staging.nix-ci.com
  45. 13.03 s Downloading cached safe-coloured-text-terminfo-0.3.0.0-doc from https://cache.staging.nix-ci.com
  46. 13.03 s Downloaded cached safe-coloured-text-layout-0.2.0.1-doc in 0ms
  47. 13.03 s Downloaded cached safe-coloured-text-terminfo-0.3.0.0-doc in 0ms
  48. 13.03 s Progress: 0 of 5 built, 10 of 40 downloaded from cache (6 downloading)
  49. 13.03 s Progress: 0 of 5 built, 11 of 40 downloaded from cache (5 downloading)
  50. 13.04 s Downloaded cached validity-unordered-containers-0.2.0.3-doc (164 KiB) in 2.7s
  51. 13.04 s Progress: 0 of 5 built, 12 of 40 downloaded from cache (4 downloading)
  52. 13.04 s Downloading cached validity-aeson-0.2.0.5-doc from https://cache.staging.nix-ci.com
  53. 13.04 s Downloaded cached validity-aeson-0.2.0.5-doc in 0ms
  54. 13.04 s Progress: 0 of 5 built, 13 of 40 downloaded from cache (4 downloading)
  55. 14.79 s Downloaded cached validity (1.5 MiB) in 4.5s
  56. 14.79 s Progress: 0 of 5 built, 14 of 40 downloaded from cache (3 downloading)
  57. 14.80 s Downloading cached validity-bytestring from https://cache.staging.nix-ci.com
  58. 14.80 s Downloading cached validity-containers from https://cache.staging.nix-ci.com
  59. 14.80 s Downloading cached validity-scientific from https://cache.staging.nix-ci.com
  60. 14.80 s Downloaded cached validity-containers in 0ms
  61. 14.80 s Downloaded cached validity-scientific in 0ms
  62. 14.80 s Downloading cached validity-text from https://cache.staging.nix-ci.com
  63. 14.80 s Downloading cached validity-unordered-containers from https://cache.staging.nix-ci.com
  64. 14.80 s Progress: 0 of 5 built, 15 of 40 downloaded from cache (8 downloading)
  65. 14.80 s Downloading cached validity-vector from https://cache.staging.nix-ci.com
  66. 14.80 s Progress: 0 of 5 built, 16 of 40 downloaded from cache (7 downloading)
  67. 14.80 s Downloaded cached validity-vector in 0ms
  68. 14.80 s Progress: 0 of 5 built, 17 of 40 downloaded from cache (6 downloading)
  69. 14.80 s Downloaded cached fast-myers-diff (1.4 MiB) in 4.5s
  70. 14.80 s Progress: 0 of 5 built, 18 of 40 downloaded from cache (5 downloading)
  71. 18.56 s Downloaded cached autodocodec-0.5.0.0-doc (2.8 MiB) in 5.5s
  72. 18.56 s Progress: 0 of 5 built, 19 of 40 downloaded from cache (4 downloading)
  73. 18.56 s Downloading cached autodocodec from https://cache.staging.nix-ci.com
  74. 18.56 s Downloading cached autodocodec-nix-0.1.0.0-doc from https://cache.staging.nix-ci.com
  75. 18.56 s Downloading cached autodocodec-schema-0.2.0.1-doc from https://cache.staging.nix-ci.com
  76. 18.56 s Downloaded cached autodocodec-nix-0.1.0.0-doc in 0ms
  77. 18.56 s Downloaded cached autodocodec-schema-0.2.0.1-doc in 0ms
  78. 18.56 s Progress: 0 of 5 built, 20 of 40 downloaded from cache (6 downloading)
  79. 18.56 s Progress: 0 of 5 built, 21 of 40 downloaded from cache (5 downloading)
  80. 18.56 s Downloading cached autodocodec-yaml-0.4.0.2-doc from https://cache.staging.nix-ci.com
  81. 18.56 s Downloaded cached validity-unordered-containers (402 KiB) in 3.7s
  82. 18.56 s Downloaded cached validity-bytestring (342 KiB) in 3.7s
  83. 18.56 s Progress: 0 of 5 built, 22 of 40 downloaded from cache (5 downloading)
  84. 18.56 s Progress: 0 of 5 built, 23 of 40 downloaded from cache (4 downloading)
  85. 18.57 s Downloaded cached validity-text (420 KiB) in 3.7s
  86. 18.57 s Progress: 0 of 5 built, 24 of 40 downloaded from cache (3 downloading)
  87. 18.57 s Downloading cached safe-coloured-text from https://cache.staging.nix-ci.com
  88. 18.57 s Downloading cached validity-aeson from https://cache.staging.nix-ci.com
  89. 18.59 s Downloaded cached sydtest-discover (3.8 MiB) in 9.1s
  90. 18.59 s Progress: 0 of 5 built, 25 of 40 downloaded from cache (4 downloading)
  91. 21.87 s Downloaded cached validity-aeson (409 KiB) in 3.3s
  92. 21.87 s Progress: 0 of 4 built, 26 of 40 downloaded from cache (3 downloading)
  93. 24.28 s Downloaded cached autodocodec (5.7 MiB) in 5.7s
  94. 24.28 s Progress: 0 of 4 built, 27 of 40 downloaded from cache (2 downloading)
  95. 24.28 s Downloaded cached safe-coloured-text (4.1 MiB) in 5.7s
  96. 24.28 s Downloaded cached autodocodec-yaml-0.4.0.2-doc (536 KiB) in 5.7s
  97. 24.29 s Downloading cached autodocodec-nix from https://cache.staging.nix-ci.com
  98. 24.29 s Progress: 0 of 4 built, 28 of 40 downloaded from cache (3 downloading)
  99. 24.29 s Downloaded cached autodocodec-nix in 0ms
  100. 24.29 s Progress: 0 of 4 built, 29 of 40 downloaded from cache (2 downloading)
  101. 24.29 s Downloading cached autodocodec-schema from https://cache.staging.nix-ci.com
  102. 24.29 s Downloaded cached autodocodec-schema in 0ms
  103. 24.29 s Downloading cached opt-env-conf-0.9.0.0-doc from https://cache.staging.nix-ci.com
  104. 24.29 s Downloading cached safe-coloured-text-layout from https://cache.staging.nix-ci.com
  105. 24.29 s Downloaded cached safe-coloured-text-layout in 0ms
  106. 24.29 s Downloading cached safe-coloured-text-terminfo from https://cache.staging.nix-ci.com
  107. 24.29 s Progress: 0 of 4 built, 30 of 40 downloaded from cache (4 downloading)
  108. 24.29 s Downloaded cached safe-coloured-text-terminfo in 0ms
  109. 24.29 s Progress: 0 of 4 built, 31 of 40 downloaded from cache (3 downloading)
  110. 24.29 s Progress: 0 of 4 built, 32 of 40 downloaded from cache (3 downloading)
  111. 24.29 s Downloading cached autodocodec-yaml from https://cache.staging.nix-ci.com
  112. 24.29 s Progress: 0 of 4 built, 33 of 40 downloaded from cache (2 downloading)
  113. 29.05 s Downloaded cached opt-env-conf-0.9.0.0-doc (5.3 MiB) in 4.7s
  114. 29.05 s Progress: 0 of 4 built, 34 of 40 downloaded from cache (1 downloading)
  115. 29.05 s Downloading cached sydtest-0.20.0.1-doc from https://cache.staging.nix-ci.com
  116. 29.92 s Downloaded cached autodocodec-yaml (1.3 MiB) in 5.6s
  117. 29.92 s Progress: 0 of 4 built, 35 of 40 downloaded from cache (1 downloading)
  118. 29.93 s Downloading cached opt-env-conf from https://cache.staging.nix-ci.com
  119. 31.54 s Downloaded cached sydtest-0.20.0.1-doc (6.3 MiB) in 2.4s
  120. 31.54 s Progress: 0 of 4 built, 36 of 40 downloaded from cache (1 downloading)
  121. 31.54 s Downloading cached sydtest-aeson-0.2.0.1-doc from https://cache.staging.nix-ci.com
  122. 31.54 s Downloaded cached sydtest-aeson-0.2.0.1-doc in 0ms
  123. 31.54 s Progress: 0 of 4 built, 37 of 40 downloaded from cache (1 downloading)
  124. 42.59 s Downloaded cached opt-env-conf (16.1 MiB) in 12.6s
  125. 42.59 s Progress: 0 of 4 built, 38 of 40 downloaded from cache
  126. 42.59 s Downloading cached sydtest from https://cache.staging.nix-ci.com
  127. 50.14 s Downloaded cached sydtest (17 MiB) in 7.5s
  128. 50.14 s Progress: 0 of 4 built, 39 of 40 downloaded from cache
  129. 50.14 s Downloading cached sydtest-aeson from https://cache.staging.nix-ci.com
  130. 50.14 s Downloaded cached sydtest-aeson in 0ms
  131. 50.14 s Progress: 0 of 3 built, 40 of 40 downloaded from cache
  132. 50.15 s Waiting for lock on schema-dot-org-jsonld-source
  133. 65.17 s Waiting for lock on schema-dot-org-jsonld
  134. 70.95 s Building /nix/store/b7wxkz1av6hmgals5h16625kcxfjpvyg-schema-dot-org-jsonld-0.0.0.0.drv
  135. 71.29 s [schema-dot-org-jsonld] Phase: setupCompilerEnvironmentPhase
  136. 71.30 s [schema-dot-org-jsonld] Build with /nix/store/k493jzz83044mqayvlb6247l35780kxy-ghc-9.10.3.
  137. 71.97 s [schema-dot-org-jsonld] Phase: unpackPhase
  138. 71.98 s [schema-dot-org-jsonld] unpacking source archive /nix/store/9q5dm03axrmxqhm6x7iqpyv5947n8j8l-schema-dot-org-jsonld-source-0.0.0.0/schema-dot-org-jsonld-0.0.0.0.tar.gz
  139. 71.99 s [schema-dot-org-jsonld] source root is schema-dot-org-jsonld-0.0.0.0
  140. 72.00 s [schema-dot-org-jsonld] setting SOURCE_DATE_EPOCH to timestamp 1788936908 of file "schema-dot-org-jsonld-0.0.0.0/test/Spec.hs"
  141. 72.00 s [schema-dot-org-jsonld] warning: file "schema-dot-org-jsonld-0.0.0.0/test/Spec.hs" may be generated; SOURCE_DATE_EPOCH may be non-deterministic
  142. 72.01 s [schema-dot-org-jsonld] Phase: patchPhase
  143. 72.03 s [schema-dot-org-jsonld] Phase: compileBuildDriverPhase
  144. 72.04 s [schema-dot-org-jsonld] setupCompileFlags: -package-db=/build/tmp.2PDxxD20lp/setup-package.conf.d -threaded
  145. 72.08 s [schema-dot-org-jsonld] [1 of 2] Compiling Main ( Setup.hs, /build/tmp.2PDxxD20lp/Main.o )
  146. 72.12 s [schema-dot-org-jsonld] [2 of 2] Linking Setup
  147. 73.47 s [schema-dot-org-jsonld] Phase: updateAutotoolsGnuConfigScriptsPhase
  148. 73.49 s [schema-dot-org-jsonld] Phase: configurePhase
  149. 73.50 s [schema-dot-org-jsonld] configureFlags: --verbose --prefix=/nix/store/8q2s09jza1l7wqhq4i0sqrkqmsx0ldiz-schema-dot-org-jsonld-0.0.0.0 --libdir=$prefix/lib/$compiler/lib --libsubdir=$abi/$libname --docdir=/nix/store/nicsxijpgvgpw191gz23d9r192p566w0-schema-dot-org-jsonld-0.0.0.0-doc/share/doc/schema-dot-org-jsonld-0.0.0.0 --with-gcc=gcc --package-db=/build/tmp.2PDxxD20lp/package.conf.d --ghc-option=-j14 --ghc-option=+RTS --ghc-option=-A64M --ghc-option=-RTS --enable-library-profiling --profiling-detail=exported-functions --disable-profiling --enable-shared --disable-coverage --enable-static --disable-executable-dynamic --enable-tests --disable-benchmarks --enable-library-vanilla --disable-library-for-ghci --enable-split-sections --enable-library-stripping --enable-executable-stripping --ghc-option=-haddock --ghc-option=-Wall --ghc-option=-Werror --extra-lib-dirs=/nix/store/wl2nw5l4x4dg6kclbgpq7v9212i1s6cy-ncurses-6.6/lib --extra-lib-dirs=/nix/store/2zs4bbi72plfm8j6zxf1js4f3yc4yzwy-libffi-3.5.2/lib --extra-lib-dirs=/nix/store/qhmqdg27kcrlkl8ida6d5hiacw0y8d21-elfutils-0.194/lib --extra-lib-dirs=/nix/store/y56aqb1m3y5davn6hsv4jfbml78qw4mv-gmp-with-cxx-6.3.0/lib --extra-lib-dirs=/nix/store/wjfhh11sfcdf97mvg7hbxickybxzk850-numactl-2.0.18/lib
  150. 73.51 s [schema-dot-org-jsonld] Using Parsec parser
  151. 73.51 s [schema-dot-org-jsonld] Configuring schema-dot-org-jsonld-0.0.0.0...
  152. 74.24 s [schema-dot-org-jsonld] Dependency aeson: using aeson-2.2.4.1
  153. 74.24 s [schema-dot-org-jsonld] Dependency base >=4.7 && <5: using base-4.20.2.0
  154. 74.24 s [schema-dot-org-jsonld] Dependency bytestring: using bytestring-0.12.2.0
  155. 74.24 s [schema-dot-org-jsonld] Dependency schema-dot-org: using schema-dot-org-0.0.0.0
  156. 74.24 s [schema-dot-org-jsonld] Dependency tagsoup: using tagsoup-0.14.8
  157. 74.24 s [schema-dot-org-jsonld] Dependency text: using text-2.1.3
  158. 74.24 s [schema-dot-org-jsonld] Dependency vector: using vector-0.13.2.0
  159. 74.24 s [schema-dot-org-jsonld] Dependency aeson: using aeson-2.2.4.1
  160. 74.24 s [schema-dot-org-jsonld] Dependency base >=4.7 && <5: using base-4.20.2.0
  161. 74.24 s [schema-dot-org-jsonld] Dependency bytestring: using bytestring-0.12.2.0
  162. 74.25 s [schema-dot-org-jsonld] Dependency path: using path-0.9.6
  163. 74.25 s [schema-dot-org-jsonld] Dependency schema-dot-org-jsonld: using schema-dot-org-jsonld-0.0.0.0
  164. 74.25 s [schema-dot-org-jsonld] Dependency sydtest: using sydtest-0.20.0.1
  165. 74.25 s [schema-dot-org-jsonld] Dependency sydtest-aeson: using sydtest-aeson-0.2.0.1
  166. 74.25 s [schema-dot-org-jsonld] Source component graph:
  167. 74.25 s [schema-dot-org-jsonld] component lib
  168. 74.25 s [schema-dot-org-jsonld] component test:schema-dot-org-jsonld-test dependency lib
  169. 74.25 s [schema-dot-org-jsonld] Configured component graph:
  170. 74.25 s [schema-dot-org-jsonld] component schema-dot-org-jsonld-0.0.0.0-IFXBqy7zHoeF7tncdo1uxB
  171. 74.25 s [schema-dot-org-jsonld] include aeson-2.2.4.1-I5kgiCyiPJO8jEV0bEgUez
  172. 74.25 s [schema-dot-org-jsonld] include base-4.20.2.0-4d66
  173. 74.25 s [schema-dot-org-jsonld] include bytestring-0.12.2.0-25ef
  174. 74.25 s [schema-dot-org-jsonld] include schema-dot-org-0.0.0.0-DK3bNdhkDmvFOAaebGqsq5
  175. 74.25 s [schema-dot-org-jsonld] include tagsoup-0.14.8-BsqbPSEZh9W5mB1CzgSWho
  176. 74.25 s [schema-dot-org-jsonld] include text-2.1.3-3f03
  177. 74.25 s [schema-dot-org-jsonld] include vector-0.13.2.0-4sNODSde54Y5T3xVFmV0fE
  178. 74.25 s [schema-dot-org-jsonld] component schema-dot-org-jsonld-0.0.0.0-Cu5ewoR91fM6pMI6cAFpDW-schema-dot-org-jsonld-test
  179. 74.25 s [schema-dot-org-jsonld] include aeson-2.2.4.1-I5kgiCyiPJO8jEV0bEgUez
  180. 74.25 s [schema-dot-org-jsonld] include base-4.20.2.0-4d66
  181. 74.25 s [schema-dot-org-jsonld] include bytestring-0.12.2.0-25ef
  182. 74.25 s [schema-dot-org-jsonld] include path-0.9.6-L3t3TcndY3P7bshtU9371n
  183. 74.25 s [schema-dot-org-jsonld] include schema-dot-org-jsonld-0.0.0.0-IFXBqy7zHoeF7tncdo1uxB
  184. 74.25 s [schema-dot-org-jsonld] include sydtest-0.20.0.1-Jo2KtBwwg0M2hH86LVxxcs
  185. 74.25 s [schema-dot-org-jsonld] include sydtest-aeson-0.2.0.1-AEtebtKhgEIKIZK2rvdpfT
  186. 74.25 s [schema-dot-org-jsonld] Linked component graph:
  187. 74.25 s [schema-dot-org-jsonld] unit schema-dot-org-jsonld-0.0.0.0-IFXBqy7zHoeF7tncdo1uxB
  188. 74.25 s [schema-dot-org-jsonld] include aeson-2.2.4.1-I5kgiCyiPJO8jEV0bEgUez
  189. 74.25 s [schema-dot-org-jsonld] include base-4.20.2.0-4d66
  190. 74.25 s [schema-dot-org-jsonld] include bytestring-0.12.2.0-25ef
  191. 74.25 s [schema-dot-org-jsonld] include schema-dot-org-0.0.0.0-DK3bNdhkDmvFOAaebGqsq5
  192. 74.25 s [schema-dot-org-jsonld] include tagsoup-0.14.8-BsqbPSEZh9W5mB1CzgSWho
  193. 74.25 s [schema-dot-org-jsonld] include text-2.1.3-3f03
  194. 74.25 s [schema-dot-org-jsonld] include vector-0.13.2.0-4sNODSde54Y5T3xVFmV0fE
  195. 74.25 s [schema-dot-org-jsonld] SchemaDotOrg.JSONLD=schema-dot-org-jsonld-0.0.0.0-IFXBqy7zHoeF7tncdo1uxB:SchemaDotOrg.JSONLD,SchemaDotOrg.JSONLD.Parse=schema-dot-org-jsonld-0.0.0.0-IFXBqy7zHoeF7tncdo1uxB:SchemaDotOrg.JSONLD.Parse,SchemaDotOrg.JSONLD.Render=schema-dot-org-jsonld-0.0.0.0-IFXBqy7zHoeF7tncdo1uxB:SchemaDotOrg.JSONLD.Render,SchemaDotOrg.JSONLD.Tagsoup=schema-dot-org-jsonld-0.0.0.0-IFXBqy7zHoeF7tncdo1uxB:SchemaDotOrg.JSONLD.Tagsoup
  196. 74.25 s [schema-dot-org-jsonld] unit schema-dot-org-jsonld-0.0.0.0-Cu5ewoR91fM6pMI6cAFpDW-schema-dot-org-jsonld-test
  197. 74.25 s [schema-dot-org-jsonld] include aeson-2.2.4.1-I5kgiCyiPJO8jEV0bEgUez
  198. 74.25 s [schema-dot-org-jsonld] include base-4.20.2.0-4d66
  199. 74.25 s [schema-dot-org-jsonld] include bytestring-0.12.2.0-25ef
  200. 74.25 s [schema-dot-org-jsonld] include path-0.9.6-L3t3TcndY3P7bshtU9371n
  201. 74.25 s [schema-dot-org-jsonld] include schema-dot-org-jsonld-0.0.0.0-IFXBqy7zHoeF7tncdo1uxB
  202. 74.25 s [schema-dot-org-jsonld] include sydtest-0.20.0.1-Jo2KtBwwg0M2hH86LVxxcs
  203. 74.25 s [schema-dot-org-jsonld] include sydtest-aeson-0.2.0.1-AEtebtKhgEIKIZK2rvdpfT
  204. 74.25 s [schema-dot-org-jsonld] Ready component graph:
  205. 74.25 s [schema-dot-org-jsonld] definite schema-dot-org-jsonld-0.0.0.0-IFXBqy7zHoeF7tncdo1uxB
  206. 74.25 s [schema-dot-org-jsonld] depends aeson-2.2.4.1-I5kgiCyiPJO8jEV0bEgUez
  207. 74.25 s [schema-dot-org-jsonld] depends base-4.20.2.0-4d66
  208. 74.25 s [schema-dot-org-jsonld] depends bytestring-0.12.2.0-25ef
  209. 74.25 s [schema-dot-org-jsonld] depends schema-dot-org-0.0.0.0-DK3bNdhkDmvFOAaebGqsq5
  210. 74.25 s [schema-dot-org-jsonld] depends tagsoup-0.14.8-BsqbPSEZh9W5mB1CzgSWho
  211. 74.25 s [schema-dot-org-jsonld] depends text-2.1.3-3f03
  212. 74.25 s [schema-dot-org-jsonld] depends vector-0.13.2.0-4sNODSde54Y5T3xVFmV0fE
  213. 74.25 s [schema-dot-org-jsonld] definite schema-dot-org-jsonld-0.0.0.0-Cu5ewoR91fM6pMI6cAFpDW-schema-dot-org-jsonld-test
  214. 74.25 s [schema-dot-org-jsonld] depends aeson-2.2.4.1-I5kgiCyiPJO8jEV0bEgUez
  215. 74.25 s [schema-dot-org-jsonld] depends base-4.20.2.0-4d66
  216. 74.25 s [schema-dot-org-jsonld] depends bytestring-0.12.2.0-25ef
  217. 74.25 s [schema-dot-org-jsonld] depends path-0.9.6-L3t3TcndY3P7bshtU9371n
  218. 74.25 s [schema-dot-org-jsonld] depends schema-dot-org-jsonld-0.0.0.0-IFXBqy7zHoeF7tncdo1uxB
  219. 74.25 s [schema-dot-org-jsonld] depends sydtest-0.20.0.1-Jo2KtBwwg0M2hH86LVxxcs
  220. 74.25 s [schema-dot-org-jsonld] depends sydtest-aeson-0.2.0.1-AEtebtKhgEIKIZK2rvdpfT
  221. 74.25 s [schema-dot-org-jsonld] Using Cabal-3.12.1.0 compiled by ghc-9.10
  222. 74.25 s [schema-dot-org-jsonld] Using compiler: ghc-9.10.3
  223. 74.25 s [schema-dot-org-jsonld] Using install prefix:
  224. 74.25 s [schema-dot-org-jsonld] /nix/store/8q2s09jza1l7wqhq4i0sqrkqmsx0ldiz-schema-dot-org-jsonld-0.0.0.0
  225. 74.25 s [schema-dot-org-jsonld] Executables installed in:
  226. 74.25 s [schema-dot-org-jsonld] /nix/store/8q2s09jza1l7wqhq4i0sqrkqmsx0ldiz-schema-dot-org-jsonld-0.0.0.0/bin
  227. 74.25 s [schema-dot-org-jsonld] Libraries installed in:
  228. 74.25 s [schema-dot-org-jsonld] /nix/store/8q2s09jza1l7wqhq4i0sqrkqmsx0ldiz-schema-dot-org-jsonld-0.0.0.0/lib/ghc-9.10.3/lib/x86_64-linux-ghc-9.10.3-21af/schema-dot-org-jsonld-0.0.0.0-IFXBqy7zHoeF7tncdo1uxB
  229. 74.25 s [schema-dot-org-jsonld] Dynamic Libraries installed in:
  230. 74.25 s [schema-dot-org-jsonld] /nix/store/8q2s09jza1l7wqhq4i0sqrkqmsx0ldiz-schema-dot-org-jsonld-0.0.0.0/lib/ghc-9.10.3/lib/x86_64-linux-ghc-9.10.3-21af
  231. 74.25 s [schema-dot-org-jsonld] Private executables installed in:
  232. 74.25 s [schema-dot-org-jsonld] /nix/store/8q2s09jza1l7wqhq4i0sqrkqmsx0ldiz-schema-dot-org-jsonld-0.0.0.0/libexec/x86_64-linux-ghc-9.10.3-21af/schema-dot-org-jsonld-0.0.0.0
  233. 74.25 s [schema-dot-org-jsonld] Data files installed in:
  234. 74.25 s [schema-dot-org-jsonld] /nix/store/8q2s09jza1l7wqhq4i0sqrkqmsx0ldiz-schema-dot-org-jsonld-0.0.0.0/share/x86_64-linux-ghc-9.10.3-21af/schema-dot-org-jsonld-0.0.0.0
  235. 74.25 s [schema-dot-org-jsonld] Documentation installed in:
  236. 74.25 s [schema-dot-org-jsonld] /nix/store/nicsxijpgvgpw191gz23d9r192p566w0-schema-dot-org-jsonld-0.0.0.0-doc/share/doc/schema-dot-org-jsonld-0.0.0.0
  237. 74.25 s [schema-dot-org-jsonld] Configuration files installed in:
  238. 74.25 s [schema-dot-org-jsonld] /nix/store/8q2s09jza1l7wqhq4i0sqrkqmsx0ldiz-schema-dot-org-jsonld-0.0.0.0/etc
  239. 74.25 s [schema-dot-org-jsonld] No alex found
  240. 74.25 s [schema-dot-org-jsonld] Using ar found on system at:
  241. 74.25 s [schema-dot-org-jsonld] /nix/store/mbyy19mdwnfvfwmdi0gqgggx0njvpl1w-binutils-wrapper-2.46/bin/ar
  242. 74.25 s [schema-dot-org-jsonld] No c2hs found
  243. 74.25 s [schema-dot-org-jsonld] No cpphs found
  244. 74.25 s [schema-dot-org-jsonld] No doctest found
  245. 74.25 s [schema-dot-org-jsonld] Using gcc version 15.2.0 given by user at:
  246. 74.25 s [schema-dot-org-jsonld] /nix/store/788mx070y81zjlg5ipcl0cra3afviw9k-gcc-wrapper-15.2.0/bin/gcc
  247. 74.25 s [schema-dot-org-jsonld] Using ghc version 9.10.3 found on system at:
  248. 74.25 s [schema-dot-org-jsonld] /nix/store/k493jzz83044mqayvlb6247l35780kxy-ghc-9.10.3/bin/ghc
  249. 74.25 s [schema-dot-org-jsonld] Using ghc-pkg version 9.10.3 found on system at:
  250. 74.25 s [schema-dot-org-jsonld] /nix/store/k493jzz83044mqayvlb6247l35780kxy-ghc-9.10.3/bin/ghc-pkg-9.10.3
  251. 74.25 s [schema-dot-org-jsonld] No ghcjs found
  252. 74.25 s [schema-dot-org-jsonld] No ghcjs-pkg found
  253. 74.25 s [schema-dot-org-jsonld] No greencard found
  254. 74.25 s [schema-dot-org-jsonld] Using haddock version 2.31.1 found on system at:
  255. 74.25 s [schema-dot-org-jsonld] /nix/store/k493jzz83044mqayvlb6247l35780kxy-ghc-9.10.3/bin/haddock-ghc-9.10.3
  256. 74.25 s [schema-dot-org-jsonld] No happy found
  257. 74.25 s [schema-dot-org-jsonld] Using haskell-suite found on system at: haskell-suite-dummy-location
  258. 74.25 s [schema-dot-org-jsonld] Using haskell-suite-pkg found on system at: haskell-suite-pkg-dummy-location
  259. 74.25 s [schema-dot-org-jsonld] No hmake found
  260. 74.25 s [schema-dot-org-jsonld] Using hpc version 0.69 found on system at:
  261. 74.25 s [schema-dot-org-jsonld] /nix/store/k493jzz83044mqayvlb6247l35780kxy-ghc-9.10.3/bin/hpc-ghc-9.10.3
  262. 74.25 s [schema-dot-org-jsonld] Using hsc2hs version 0.68.10 found on system at:
  263. 74.25 s [schema-dot-org-jsonld] /nix/store/k493jzz83044mqayvlb6247l35780kxy-ghc-9.10.3/bin/hsc2hs-ghc-9.10.3
  264. 74.25 s [schema-dot-org-jsonld] Using hscolour version 1.25 found on system at:
  265. 74.25 s [schema-dot-org-jsonld] /nix/store/hvlf3xzdw0p5s3kybdkch6iqyz0740rc-hscolour-1.25/bin/HsColour
  266. 74.25 s [schema-dot-org-jsonld] No jhc found
  267. 74.25 s [schema-dot-org-jsonld] Using ld found on system at:
  268. 74.25 s [schema-dot-org-jsonld] /nix/store/788mx070y81zjlg5ipcl0cra3afviw9k-gcc-wrapper-15.2.0/bin/ld
  269. 74.25 s [schema-dot-org-jsonld] No pkg-config found
  270. 74.25 s [schema-dot-org-jsonld] Using runghc version 9.10.3 found on system at:
  271. 74.25 s [schema-dot-org-jsonld] /nix/store/k493jzz83044mqayvlb6247l35780kxy-ghc-9.10.3/bin/runghc-9.10.3
  272. 74.25 s [schema-dot-org-jsonld] Using strip version 2.46 found on system at:
  273. 74.25 s [schema-dot-org-jsonld] /nix/store/788mx070y81zjlg5ipcl0cra3afviw9k-gcc-wrapper-15.2.0/bin/strip
  274. 74.25 s [schema-dot-org-jsonld] Using tar found on system at:
  275. 74.25 s [schema-dot-org-jsonld] /nix/store/k5akwnrn9x2afaj2va7g4a2zpdim8l43-gnutar-1.35/bin/tar
  276. 74.25 s [schema-dot-org-jsonld] No uhc found
  277. 75.42 s [schema-dot-org-jsonld] Phase: buildPhase
  278. 75.50 s [schema-dot-org-jsonld] Preprocessing library for schema-dot-org-jsonld-0.0.0.0...
  279. 75.51 s [schema-dot-org-jsonld] Building library for schema-dot-org-jsonld-0.0.0.0...
  280. 75.60 s [schema-dot-org-jsonld] [1 of 5] Compiling Paths_schema_dot_org_jsonld ( dist/build/autogen/Paths_schema_dot_org_jsonld.hs, dist/build/Paths_schema_dot_org_jsonld.o, dist/build/Paths_schema_dot_org_jsonld.dyn_o )
  281. 75.75 s [schema-dot-org-jsonld] [2 of 5] Compiling SchemaDotOrg.JSONLD.Parse ( src/SchemaDotOrg/JSONLD/Parse.hs, dist/build/SchemaDotOrg/JSONLD/Parse.o, dist/build/SchemaDotOrg/JSONLD/Parse.dyn_o )
  282. 76.28 s [schema-dot-org-jsonld] [3 of 5] Compiling SchemaDotOrg.JSONLD.Render ( src/SchemaDotOrg/JSONLD/Render.hs, dist/build/SchemaDotOrg/JSONLD/Render.o, dist/build/SchemaDotOrg/JSONLD/Render.dyn_o )
  283. 76.28 s [schema-dot-org-jsonld] [4 of 5] Compiling SchemaDotOrg.JSONLD.Tagsoup ( src/SchemaDotOrg/JSONLD/Tagsoup.hs, dist/build/SchemaDotOrg/JSONLD/Tagsoup.o, dist/build/SchemaDotOrg/JSONLD/Tagsoup.dyn_o )
  284. 76.39 s [schema-dot-org-jsonld] [5 of 5] Compiling SchemaDotOrg.JSONLD ( src/SchemaDotOrg/JSONLD.hs, dist/build/SchemaDotOrg/JSONLD.o, dist/build/SchemaDotOrg/JSONLD.dyn_o )
  285. 76.63 s [schema-dot-org-jsonld] [1 of 5] Compiling Paths_schema_dot_org_jsonld ( dist/build/autogen/Paths_schema_dot_org_jsonld.hs, dist/build/Paths_schema_dot_org_jsonld.p_o )
  286. 76.92 s [schema-dot-org-jsonld] [2 of 5] Compiling SchemaDotOrg.JSONLD.Parse ( src/SchemaDotOrg/JSONLD/Parse.hs, dist/build/SchemaDotOrg/JSONLD/Parse.p_o )
  287. 77.40 s [schema-dot-org-jsonld] [3 of 5] Compiling SchemaDotOrg.JSONLD.Render ( src/SchemaDotOrg/JSONLD/Render.hs, dist/build/SchemaDotOrg/JSONLD/Render.p_o )
  288. 77.40 s [schema-dot-org-jsonld] [4 of 5] Compiling SchemaDotOrg.JSONLD.Tagsoup ( src/SchemaDotOrg/JSONLD/Tagsoup.hs, dist/build/SchemaDotOrg/JSONLD/Tagsoup.p_o )
  289. 77.53 s [schema-dot-org-jsonld] [5 of 5] Compiling SchemaDotOrg.JSONLD ( src/SchemaDotOrg/JSONLD.hs, dist/build/SchemaDotOrg/JSONLD.p_o )
  290. 79.49 s [schema-dot-org-jsonld] Preprocessing test suite 'schema-dot-org-jsonld-test' for schema-dot-org-jsonld-0.0.0.0...
  291. 79.49 s [schema-dot-org-jsonld] Building test suite 'schema-dot-org-jsonld-test' for schema-dot-org-jsonld-0.0.0.0...
  292. 79.60 s [schema-dot-org-jsonld] [1 of 3] Compiling Paths_schema_dot_org_jsonld ( dist/build/schema-dot-org-jsonld-test/autogen/Paths_schema_dot_org_jsonld.hs, dist/build/schema-dot-org-jsonld-test/schema-dot-org-jsonld-test-tmp/Paths_schema_dot_org_jsonld.o )
  293. 79.70 s [schema-dot-org-jsonld] [2 of 3] Compiling SchemaDotOrg.JSONLD.TagsoupSpec ( test/SchemaDotOrg/JSONLD/TagsoupSpec.hs, dist/build/schema-dot-org-jsonld-test/schema-dot-org-jsonld-test-tmp/SchemaDotOrg/JSONLD/TagsoupSpec.o )
  294. 79.77 s [schema-dot-org-jsonld] test/SchemaDotOrg/JSONLD/TagsoupSpec.hs:33:25: error: [GHC-83865]
  295. 79.77 s [schema-dot-org-jsonld] • Couldn't match type: Path.Internal.Posix.Path
  296. 79.77 s [schema-dot-org-jsonld] Path.Posix.Rel Path.Posix.Dir
  297. 79.77 s [schema-dot-org-jsonld] with: [Char]
  298. 79.77 s [schema-dot-org-jsonld] Expected: FilePath
  299. 79.77 s [schema-dot-org-jsonld] Actual: Path.Internal.Posix.Path Path.Posix.Rel Path.Posix.Dir
  300. 79.77 s [schema-dot-org-jsonld] • In the first argument of ‘scenarioDir’, namely
  301. 79.77 s [schema-dot-org-jsonld] ‘(Path.Internal.Posix.Path "test_resources/" ::
  302. 79.77 s [schema-dot-org-jsonld] Path.Internal.Posix.Path Path.Posix.Rel Path.Posix.Dir)’
  303. 79.77 s [schema-dot-org-jsonld] In the first argument of ‘($)’, namely
  304. 79.77 s [schema-dot-org-jsonld] ‘scenarioDir
  305. 79.77 s [schema-dot-org-jsonld] (Path.Internal.Posix.Path "test_resources/" ::
  306. 79.77 s [schema-dot-org-jsonld] Path.Internal.Posix.Path Path.Posix.Rel Path.Posix.Dir)’
  307. 79.77 s [schema-dot-org-jsonld] In the second argument of ‘($)’, namely
  308. 79.77 s [schema-dot-org-jsonld] ‘scenarioDir
  309. 79.77 s [schema-dot-org-jsonld] (Path.Internal.Posix.Path "test_resources/" ::
  310. 79.77 s [schema-dot-org-jsonld] Path.Internal.Posix.Path Path.Posix.Rel Path.Posix.Dir)
  311. 79.77 s [schema-dot-org-jsonld] $ \ file
  312. 79.77 s [schema-dot-org-jsonld] -> when (fileExtension file == Just ".html")
  313. 79.77 s [schema-dot-org-jsonld] $ do let ...
  314. 79.77 s [schema-dot-org-jsonld] it (unwords [...]) $ do ...’
  315. 79.77 s [schema-dot-org-jsonld] |
  316. 79.77 s [schema-dot-org-jsonld] 33 | scenarioDir [reldir|test_resources|] $ \file ->
  317. 79.77 s [schema-dot-org-jsonld] | ^^^^^^^^^^^^^^^^
  318. 79.77 s [schema-dot-org-jsonld]
  319. 79.77 s [schema-dot-org-jsonld] test/SchemaDotOrg/JSONLD/TagsoupSpec.hs:34:27: error: [GHC-83865]
  320. 79.77 s [schema-dot-org-jsonld] • Couldn't match type: [Char]
  321. 79.77 s [schema-dot-org-jsonld] with: Path.Internal.Posix.Path b0 Path.Posix.File
  322. 79.77 s [schema-dot-org-jsonld] Expected: Path.Internal.Posix.Path b0 Path.Posix.File
  323. 79.77 s [schema-dot-org-jsonld] Actual: FilePath
  324. 79.77 s [schema-dot-org-jsonld] • In the first argument of ‘fileExtension’, namely ‘file’
  325. 79.77 s [schema-dot-org-jsonld] In the first argument of ‘(==)’, namely ‘fileExtension file’
  326. 79.77 s [schema-dot-org-jsonld] In the first argument of ‘when’, namely
  327. 79.77 s [schema-dot-org-jsonld] ‘(fileExtension file == Just ".html")’
  328. 79.77 s [schema-dot-org-jsonld] |
  329. 79.77 s [schema-dot-org-jsonld] 34 | when (fileExtension file == Just ".html") $ do
  330. 79.77 s [schema-dot-org-jsonld] | ^^^^
  331. 79.77 s [schema-dot-org-jsonld]
  332. 79.77 s [schema-dot-org-jsonld] test/SchemaDotOrg/JSONLD/TagsoupSpec.hs:35:30: error: [GHC-83865]
  333. 79.77 s [schema-dot-org-jsonld] • Couldn't match type: [Char]
  334. 79.77 s [schema-dot-org-jsonld] with: Path.Internal.Posix.Path Path.Posix.Rel Path.Posix.File
  335. 79.77 s [schema-dot-org-jsonld] Expected: Path.Internal.Posix.Path Path.Posix.Rel Path.Posix.File
  336. 79.77 s [schema-dot-org-jsonld] Actual: FilePath
  337. 79.77 s [schema-dot-org-jsonld] • In the first argument of ‘fromRelFile’, namely ‘file’
  338. 79.77 s [schema-dot-org-jsonld] In the expression: fromRelFile file
  339. 79.77 s [schema-dot-org-jsonld] In an equation for ‘fp’: fp = fromRelFile file
  340. 79.77 s [schema-dot-org-jsonld] |
  341. 79.77 s [schema-dot-org-jsonld] 35 | let fp = fromRelFile file
  342. 79.77 s [schema-dot-org-jsonld] | ^^^^
  343. 79.77 s [schema-dot-org-jsonld]
  344. 80.01 s Progress: 0 of 1 built (1 failed), 40 of 40 downloaded from cache
  345. 80.01 s Failed to build schema-dot-org-jsonld after 9.0s
  346. 80.02 s Cannot build '/nix/store/b7wxkz1av6hmgals5h16625kcxfjpvyg-schema-dot-org-jsonld-0.0.0.0.drv'.
  347. 80.02 s Reason: builder failed with exit code 1.
  348. 80.02 s Output paths:
  349. 80.02 s /nix/store/8q2s09jza1l7wqhq4i0sqrkqmsx0ldiz-schema-dot-org-jsonld-0.0.0.0
  350. 80.02 s /nix/store/nicsxijpgvgpw191gz23d9r192p566w0-schema-dot-org-jsonld-0.0.0.0-doc
  351. 80.02 s Last 209 log lines:
  352. 80.02 s > Running phase: setupCompilerEnvironmentPhase
  353. 80.02 s > Build with /nix/store/k493jzz83044mqayvlb6247l35780kxy-ghc-9.10.3.
  354. 80.02 s > Running phase: unpackPhase
  355. 80.02 s > unpacking source archive /nix/store/9q5dm03axrmxqhm6x7iqpyv5947n8j8l-schema-dot-org-jsonld-source-0.0.0.0/schema-dot-org-jsonld-0.0.0.0.tar.gz
  356. 80.02 s > source root is schema-dot-org-jsonld-0.0.0.0
  357. 80.02 s > setting SOURCE_DATE_EPOCH to timestamp 1788936908 of file "schema-dot-org-jsonld-0.0.0.0/test/Spec.hs"
  358. 80.02 s > warning: file "schema-dot-org-jsonld-0.0.0.0/test/Spec.hs" may be generated; SOURCE_DATE_EPOCH may be non-deterministic
  359. 80.02 s > Running phase: patchPhase
  360. 80.02 s > Running phase: compileBuildDriverPhase
  361. 80.02 s > setupCompileFlags: -package-db=/build/tmp.2PDxxD20lp/setup-package.conf.d -threaded
  362. 80.02 s > [1 of 2] Compiling Main ( Setup.hs, /build/tmp.2PDxxD20lp/Main.o )
  363. 80.02 s > [2 of 2] Linking Setup
  364. 80.02 s > Running phase: updateAutotoolsGnuConfigScriptsPhase
  365. 80.02 s > Running phase: configurePhase
  366. 80.02 s > configureFlags: --verbose --prefix=/nix/store/8q2s09jza1l7wqhq4i0sqrkqmsx0ldiz-schema-dot-org-jsonld-0.0.0.0 --libdir=$prefix/lib/$compiler/lib --libsubdir=$abi/$libname --docdir=/nix/store/nicsxijpgvgpw191gz23d9r192p566w0-schema-dot-org-jsonld-0.0.0.0-doc/share/doc/schema-dot-org-jsonld-0.0.0.0 --with-gcc=gcc --package-db=/build/tmp.2PDxxD20lp/package.conf.d --ghc-option=-j14 --ghc-option=+RTS --ghc-option=-A64M --ghc-option=-RTS --enable-library-profiling --profiling-detail=exported-functions --disable-profiling --enable-shared --disable-coverage --enable-static --disable-executable-dynamic --enable-tests --disable-benchmarks --enable-library-vanilla --disable-library-for-ghci --enable-split-sections --enable-library-stripping --enable-executable-stripping --ghc-option=-haddock --ghc-option=-Wall --ghc-option=-Werror --extra-lib-dirs=/nix/store/wl2nw5l4x4dg6kclbgpq7v9212i1s6cy-ncurses-6.6/lib --extra-lib-dirs=/nix/store/2zs4bbi72plfm8j6zxf1js4f3yc4yzwy-libffi-3.5.2/lib --extra-lib-dirs=/nix/store/qhmqdg27kcrlkl8ida6d5hiacw0y8d21-elfutils-0.194/lib --extra-lib-dirs=/nix/store/y56aqb1m3y5davn6hsv4jfbml78qw4mv-gmp-with-cxx-6.3.0/lib --extra-lib-dirs=/nix/store/wjfhh11sfcdf97mvg7hbxickybxzk850-numactl-2.0.18/lib
  367. 80.02 s > Using Parsec parser
  368. 80.02 s > Configuring schema-dot-org-jsonld-0.0.0.0...
  369. 80.02 s > Dependency aeson: using aeson-2.2.4.1
  370. 80.02 s > Dependency base >=4.7 && <5: using base-4.20.2.0
  371. 80.02 s > Dependency bytestring: using bytestring-0.12.2.0
  372. 80.02 s > Dependency schema-dot-org: using schema-dot-org-0.0.0.0
  373. 80.02 s > Dependency tagsoup: using tagsoup-0.14.8
  374. 80.02 s > Dependency text: using text-2.1.3
  375. 80.02 s > Dependency vector: using vector-0.13.2.0
  376. 80.02 s > Dependency aeson: using aeson-2.2.4.1
  377. 80.02 s > Dependency base >=4.7 && <5: using base-4.20.2.0
  378. 80.02 s > Dependency bytestring: using bytestring-0.12.2.0
  379. 80.02 s > Dependency path: using path-0.9.6
  380. 80.02 s > Dependency schema-dot-org-jsonld: using schema-dot-org-jsonld-0.0.0.0
  381. 80.02 s > Dependency sydtest: using sydtest-0.20.0.1
  382. 80.02 s > Dependency sydtest-aeson: using sydtest-aeson-0.2.0.1
  383. 80.02 s > Source component graph:
  384. 80.02 s > component lib
  385. 80.02 s > component test:schema-dot-org-jsonld-test dependency lib
  386. 80.02 s > Configured component graph:
  387. 80.02 s > component schema-dot-org-jsonld-0.0.0.0-IFXBqy7zHoeF7tncdo1uxB
  388. 80.02 s > include aeson-2.2.4.1-I5kgiCyiPJO8jEV0bEgUez
  389. 80.02 s > include base-4.20.2.0-4d66
  390. 80.02 s > include bytestring-0.12.2.0-25ef
  391. 80.02 s > include schema-dot-org-0.0.0.0-DK3bNdhkDmvFOAaebGqsq5
  392. 80.02 s > include tagsoup-0.14.8-BsqbPSEZh9W5mB1CzgSWho
  393. 80.02 s > include text-2.1.3-3f03
  394. 80.02 s > include vector-0.13.2.0-4sNODSde54Y5T3xVFmV0fE
  395. 80.02 s > component schema-dot-org-jsonld-0.0.0.0-Cu5ewoR91fM6pMI6cAFpDW-schema-dot-org-jsonld-test
  396. 80.02 s > include aeson-2.2.4.1-I5kgiCyiPJO8jEV0bEgUez
  397. 80.02 s > include base-4.20.2.0-4d66
  398. 80.02 s > include bytestring-0.12.2.0-25ef
  399. 80.02 s > include path-0.9.6-L3t3TcndY3P7bshtU9371n
  400. 80.02 s > include schema-dot-org-jsonld-0.0.0.0-IFXBqy7zHoeF7tncdo1uxB
  401. 80.02 s > include sydtest-0.20.0.1-Jo2KtBwwg0M2hH86LVxxcs
  402. 80.02 s > include sydtest-aeson-0.2.0.1-AEtebtKhgEIKIZK2rvdpfT
  403. 80.02 s > Linked component graph:
  404. 80.02 s > unit schema-dot-org-jsonld-0.0.0.0-IFXBqy7zHoeF7tncdo1uxB
  405. 80.02 s > include aeson-2.2.4.1-I5kgiCyiPJO8jEV0bEgUez
  406. 80.02 s > include base-4.20.2.0-4d66
  407. 80.02 s > include bytestring-0.12.2.0-25ef
  408. 80.02 s > include schema-dot-org-0.0.0.0-DK3bNdhkDmvFOAaebGqsq5
  409. 80.02 s > include tagsoup-0.14.8-BsqbPSEZh9W5mB1CzgSWho
  410. 80.02 s > include text-2.1.3-3f03
  411. 80.02 s > include vector-0.13.2.0-4sNODSde54Y5T3xVFmV0fE
  412. 80.02 s > SchemaDotOrg.JSONLD=schema-dot-org-jsonld-0.0.0.0-IFXBqy7zHoeF7tncdo1uxB:SchemaDotOrg.JSONLD,SchemaDotOrg.JSONLD.Parse=schema-dot-org-jsonld-0.0.0.0-IFXBqy7zHoeF7tncdo1uxB:SchemaDotOrg.JSONLD.Parse,SchemaDotOrg.JSONLD.Render=schema-dot-org-jsonld-0.0.0.0-IFXBqy7zHoeF7tncdo1uxB:SchemaDotOrg.JSONLD.Render,SchemaDotOrg.JSONLD.Tagsoup=schema-dot-org-jsonld-0.0.0.0-IFXBqy7zHoeF7tncdo1uxB:SchemaDotOrg.JSONLD.Tagsoup
  413. 80.02 s > unit schema-dot-org-jsonld-0.0.0.0-Cu5ewoR91fM6pMI6cAFpDW-schema-dot-org-jsonld-test
  414. 80.02 s > include aeson-2.2.4.1-I5kgiCyiPJO8jEV0bEgUez
  415. 80.02 s > include base-4.20.2.0-4d66
  416. 80.02 s > include bytestring-0.12.2.0-25ef
  417. 80.02 s > include path-0.9.6-L3t3TcndY3P7bshtU9371n
  418. 80.02 s > include schema-dot-org-jsonld-0.0.0.0-IFXBqy7zHoeF7tncdo1uxB
  419. 80.02 s > include sydtest-0.20.0.1-Jo2KtBwwg0M2hH86LVxxcs
  420. 80.02 s > include sydtest-aeson-0.2.0.1-AEtebtKhgEIKIZK2rvdpfT
  421. 80.02 s > Ready component graph:
  422. 80.02 s > definite schema-dot-org-jsonld-0.0.0.0-IFXBqy7zHoeF7tncdo1uxB
  423. 80.02 s > depends aeson-2.2.4.1-I5kgiCyiPJO8jEV0bEgUez
  424. 80.02 s > depends base-4.20.2.0-4d66
  425. 80.02 s > depends bytestring-0.12.2.0-25ef
  426. 80.02 s > depends schema-dot-org-0.0.0.0-DK3bNdhkDmvFOAaebGqsq5
  427. 80.02 s > depends tagsoup-0.14.8-BsqbPSEZh9W5mB1CzgSWho
  428. 80.02 s > depends text-2.1.3-3f03
  429. 80.02 s > depends vector-0.13.2.0-4sNODSde54Y5T3xVFmV0fE
  430. 80.02 s > definite schema-dot-org-jsonld-0.0.0.0-Cu5ewoR91fM6pMI6cAFpDW-schema-dot-org-jsonld-test
  431. 80.02 s > depends aeson-2.2.4.1-I5kgiCyiPJO8jEV0bEgUez
  432. 80.02 s > depends base-4.20.2.0-4d66
  433. 80.02 s > depends bytestring-0.12.2.0-25ef
  434. 80.02 s > depends path-0.9.6-L3t3TcndY3P7bshtU9371n
  435. 80.02 s > depends schema-dot-org-jsonld-0.0.0.0-IFXBqy7zHoeF7tncdo1uxB
  436. 80.02 s > depends sydtest-0.20.0.1-Jo2KtBwwg0M2hH86LVxxcs
  437. 80.02 s > depends sydtest-aeson-0.2.0.1-AEtebtKhgEIKIZK2rvdpfT
  438. 80.02 s > Using Cabal-3.12.1.0 compiled by ghc-9.10
  439. 80.02 s > Using compiler: ghc-9.10.3
  440. 80.02 s > Using install prefix:
  441. 80.02 s > /nix/store/8q2s09jza1l7wqhq4i0sqrkqmsx0ldiz-schema-dot-org-jsonld-0.0.0.0
  442. 80.02 s > Executables installed in:
  443. 80.02 s > /nix/store/8q2s09jza1l7wqhq4i0sqrkqmsx0ldiz-schema-dot-org-jsonld-0.0.0.0/bin
  444. 80.02 s > Libraries installed in:
  445. 80.02 s > /nix/store/8q2s09jza1l7wqhq4i0sqrkqmsx0ldiz-schema-dot-org-jsonld-0.0.0.0/lib/ghc-9.10.3/lib/x86_64-linux-ghc-9.10.3-21af/schema-dot-org-jsonld-0.0.0.0-IFXBqy7zHoeF7tncdo1uxB
  446. 80.02 s > Dynamic Libraries installed in:
  447. 80.02 s > /nix/store/8q2s09jza1l7wqhq4i0sqrkqmsx0ldiz-schema-dot-org-jsonld-0.0.0.0/lib/ghc-9.10.3/lib/x86_64-linux-ghc-9.10.3-21af
  448. 80.02 s > Private executables installed in:
  449. 80.02 s > /nix/store/8q2s09jza1l7wqhq4i0sqrkqmsx0ldiz-schema-dot-org-jsonld-0.0.0.0/libexec/x86_64-linux-ghc-9.10.3-21af/schema-dot-org-jsonld-0.0.0.0
  450. 80.02 s > Data files installed in:
  451. 80.02 s > /nix/store/8q2s09jza1l7wqhq4i0sqrkqmsx0ldiz-schema-dot-org-jsonld-0.0.0.0/share/x86_64-linux-ghc-9.10.3-21af/schema-dot-org-jsonld-0.0.0.0
  452. 80.02 s > Documentation installed in:
  453. 80.02 s > /nix/store/nicsxijpgvgpw191gz23d9r192p566w0-schema-dot-org-jsonld-0.0.0.0-doc/share/doc/schema-dot-org-jsonld-0.0.0.0
  454. 80.02 s > Configuration files installed in:
  455. 80.02 s > /nix/store/8q2s09jza1l7wqhq4i0sqrkqmsx0ldiz-schema-dot-org-jsonld-0.0.0.0/etc
  456. 80.02 s > No alex found
  457. 80.02 s > Using ar found on system at:
  458. 80.02 s > /nix/store/mbyy19mdwnfvfwmdi0gqgggx0njvpl1w-binutils-wrapper-2.46/bin/ar
  459. 80.02 s > No c2hs found
  460. 80.02 s > No cpphs found
  461. 80.02 s > No doctest found
  462. 80.02 s > Using gcc version 15.2.0 given by user at:
  463. 80.02 s > /nix/store/788mx070y81zjlg5ipcl0cra3afviw9k-gcc-wrapper-15.2.0/bin/gcc
  464. 80.02 s > Using ghc version 9.10.3 found on system at:
  465. 80.02 s > /nix/store/k493jzz83044mqayvlb6247l35780kxy-ghc-9.10.3/bin/ghc
  466. 80.02 s > Using ghc-pkg version 9.10.3 found on system at:
  467. 80.02 s > /nix/store/k493jzz83044mqayvlb6247l35780kxy-ghc-9.10.3/bin/ghc-pkg-9.10.3
  468. 80.02 s > No ghcjs found
  469. 80.02 s > No ghcjs-pkg found
  470. 80.02 s > No greencard found
  471. 80.02 s > Using haddock version 2.31.1 found on system at:
  472. 80.02 s > /nix/store/k493jzz83044mqayvlb6247l35780kxy-ghc-9.10.3/bin/haddock-ghc-9.10.3
  473. 80.02 s > No happy found
  474. 80.02 s > Using haskell-suite found on system at: haskell-suite-dummy-location
  475. 80.02 s > Using haskell-suite-pkg found on system at: haskell-suite-pkg-dummy-location
  476. 80.02 s > No hmake found
  477. 80.02 s > Using hpc version 0.69 found on system at:
  478. 80.02 s > /nix/store/k493jzz83044mqayvlb6247l35780kxy-ghc-9.10.3/bin/hpc-ghc-9.10.3
  479. 80.02 s > Using hsc2hs version 0.68.10 found on system at:
  480. 80.02 s > /nix/store/k493jzz83044mqayvlb6247l35780kxy-ghc-9.10.3/bin/hsc2hs-ghc-9.10.3
  481. 80.02 s > Using hscolour version 1.25 found on system at:
  482. 80.02 s > /nix/store/hvlf3xzdw0p5s3kybdkch6iqyz0740rc-hscolour-1.25/bin/HsColour
  483. 80.02 s > No jhc found
  484. 80.02 s > Using ld found on system at:
  485. 80.02 s > /nix/store/788mx070y81zjlg5ipcl0cra3afviw9k-gcc-wrapper-15.2.0/bin/ld
  486. 80.02 s > No pkg-config found
  487. 80.02 s > Using runghc version 9.10.3 found on system at:
  488. 80.02 s > /nix/store/k493jzz83044mqayvlb6247l35780kxy-ghc-9.10.3/bin/runghc-9.10.3
  489. 80.02 s > Using strip version 2.46 found on system at:
  490. 80.02 s > /nix/store/788mx070y81zjlg5ipcl0cra3afviw9k-gcc-wrapper-15.2.0/bin/strip
  491. 80.02 s > Using tar found on system at:
  492. 80.02 s > /nix/store/k5akwnrn9x2afaj2va7g4a2zpdim8l43-gnutar-1.35/bin/tar
  493. 80.02 s > No uhc found
  494. 80.02 s > Running phase: buildPhase
  495. 80.02 s > Preprocessing library for schema-dot-org-jsonld-0.0.0.0...
  496. 80.02 s > Building library for schema-dot-org-jsonld-0.0.0.0...
  497. 80.02 s > [1 of 5] Compiling Paths_schema_dot_org_jsonld ( dist/build/autogen/Paths_schema_dot_org_jsonld.hs, dist/build/Paths_schema_dot_org_jsonld.o, dist/build/Paths_schema_dot_org_jsonld.dyn_o )
  498. 80.02 s > [2 of 5] Compiling SchemaDotOrg.JSONLD.Parse ( src/SchemaDotOrg/JSONLD/Parse.hs, dist/build/SchemaDotOrg/JSONLD/Parse.o, dist/build/SchemaDotOrg/JSONLD/Parse.dyn_o )
  499. 80.02 s > [3 of 5] Compiling SchemaDotOrg.JSONLD.Render ( src/SchemaDotOrg/JSONLD/Render.hs, dist/build/SchemaDotOrg/JSONLD/Render.o, dist/build/SchemaDotOrg/JSONLD/Render.dyn_o )
  500. 80.02 s > [4 of 5] Compiling SchemaDotOrg.JSONLD.Tagsoup ( src/SchemaDotOrg/JSONLD/Tagsoup.hs, dist/build/SchemaDotOrg/JSONLD/Tagsoup.o, dist/build/SchemaDotOrg/JSONLD/Tagsoup.dyn_o )
  501. 80.02 s > [5 of 5] Compiling SchemaDotOrg.JSONLD ( src/SchemaDotOrg/JSONLD.hs, dist/build/SchemaDotOrg/JSONLD.o, dist/build/SchemaDotOrg/JSONLD.dyn_o )
  502. 80.02 s > [1 of 5] Compiling Paths_schema_dot_org_jsonld ( dist/build/autogen/Paths_schema_dot_org_jsonld.hs, dist/build/Paths_schema_dot_org_jsonld.p_o )
  503. 80.02 s > [2 of 5] Compiling SchemaDotOrg.JSONLD.Parse ( src/SchemaDotOrg/JSONLD/Parse.hs, dist/build/SchemaDotOrg/JSONLD/Parse.p_o )
  504. 80.02 s > [3 of 5] Compiling SchemaDotOrg.JSONLD.Render ( src/SchemaDotOrg/JSONLD/Render.hs, dist/build/SchemaDotOrg/JSONLD/Render.p_o )
  505. 80.02 s > [4 of 5] Compiling SchemaDotOrg.JSONLD.Tagsoup ( src/SchemaDotOrg/JSONLD/Tagsoup.hs, dist/build/SchemaDotOrg/JSONLD/Tagsoup.p_o )
  506. 80.02 s > [5 of 5] Compiling SchemaDotOrg.JSONLD ( src/SchemaDotOrg/JSONLD.hs, dist/build/SchemaDotOrg/JSONLD.p_o )
  507. 80.02 s > Preprocessing test suite 'schema-dot-org-jsonld-test' for schema-dot-org-jsonld-0.0.0.0...
  508. 80.02 s > Building test suite 'schema-dot-org-jsonld-test' for schema-dot-org-jsonld-0.0.0.0...
  509. 80.02 s > [1 of 3] Compiling Paths_schema_dot_org_jsonld ( dist/build/schema-dot-org-jsonld-test/autogen/Paths_schema_dot_org_jsonld.hs, dist/build/schema-dot-org-jsonld-test/schema-dot-org-jsonld-test-tmp/Paths_schema_dot_org_jsonld.o )
  510. 80.02 s > [2 of 3] Compiling SchemaDotOrg.JSONLD.TagsoupSpec ( test/SchemaDotOrg/JSONLD/TagsoupSpec.hs, dist/build/schema-dot-org-jsonld-test/schema-dot-org-jsonld-test-tmp/SchemaDotOrg/JSONLD/TagsoupSpec.o )
  511. 80.02 s > test/SchemaDotOrg/JSONLD/TagsoupSpec.hs:33:25: error: [GHC-83865]
  512. 80.02 s > • Couldn't match type: Path.Internal.Posix.Path
  513. 80.02 s > Path.Posix.Rel Path.Posix.Dir
  514. 80.02 s > with: [Char]
  515. 80.02 s > Expected: FilePath
  516. 80.02 s > Actual: Path.Internal.Posix.Path Path.Posix.Rel Path.Posix.Dir
  517. 80.02 s > • In the first argument of ‘scenarioDir’, namely
  518. 80.02 s > ‘(Path.Internal.Posix.Path "test_resources/" ::
  519. 80.02 s > Path.Internal.Posix.Path Path.Posix.Rel Path.Posix.Dir)’
  520. 80.02 s > In the first argument of ‘($)’, namely
  521. 80.02 s > ‘scenarioDir
  522. 80.02 s > (Path.Internal.Posix.Path "test_resources/" ::
  523. 80.02 s > Path.Internal.Posix.Path Path.Posix.Rel Path.Posix.Dir)’
  524. 80.02 s > In the second argument of ‘($)’, namely
  525. 80.02 s > ‘scenarioDir
  526. 80.02 s > (Path.Internal.Posix.Path "test_resources/" ::
  527. 80.02 s > Path.Internal.Posix.Path Path.Posix.Rel Path.Posix.Dir)
  528. 80.02 s > $ \ file
  529. 80.02 s > -> when (fileExtension file == Just ".html")
  530. 80.02 s > $ do let ...
  531. 80.02 s > it (unwords [...]) $ do ...’
  532. 80.02 s > |
  533. 80.02 s > 33 | scenarioDir [reldir|test_resources|] $ \file ->
  534. 80.02 s > | ^^^^^^^^^^^^^^^^
  535. 80.02 s >
  536. 80.02 s > test/SchemaDotOrg/JSONLD/TagsoupSpec.hs:34:27: error: [GHC-83865]
  537. 80.02 s > • Couldn't match type: [Char]
  538. 80.02 s > with: Path.Internal.Posix.Path b0 Path.Posix.File
  539. 80.02 s > Expected: Path.Internal.Posix.Path b0 Path.Posix.File
  540. 80.02 s > Actual: FilePath
  541. 80.02 s > • In the first argument of ‘fileExtension’, namely ‘file’
  542. 80.02 s > In the first argument of ‘(==)’, namely ‘fileExtension file’
  543. 80.02 s > In the first argument of ‘when’, namely
  544. 80.02 s > ‘(fileExtension file == Just ".html")’
  545. 80.02 s > |
  546. 80.02 s > 34 | when (fileExtension file == Just ".html") $ do
  547. 80.02 s > | ^^^^
  548. 80.02 s >
  549. 80.02 s > test/SchemaDotOrg/JSONLD/TagsoupSpec.hs:35:30: error: [GHC-83865]
  550. 80.02 s > • Couldn't match type: [Char]
  551. 80.02 s > with: Path.Internal.Posix.Path Path.Posix.Rel Path.Posix.File
  552. 80.02 s > Expected: Path.Internal.Posix.Path Path.Posix.Rel Path.Posix.File
  553. 80.02 s > Actual: FilePath
  554. 80.02 s > • In the first argument of ‘fromRelFile’, namely ‘file’
  555. 80.02 s > In the expression: fromRelFile file
  556. 80.02 s > In an equation for ‘fp’: fp = fromRelFile file
  557. 80.02 s > |
  558. 80.02 s > 35 | let fp = fromRelFile file
  559. 80.02 s > | ^^^^
  560. 80.02 s >
  561. 80.02 s For full logs, run:
  562. 80.02 s nix log /nix/store/b7wxkz1av6hmgals5h16625kcxfjpvyg-schema-dot-org-jsonld-0.0.0.0.drv
  563. 80.94 s Build failed.