1. 0.00 s $ /nix/store/9ypz3flqsrl5xl495mm8h645gadjsxi1-coreutils-9.11/bin/timeout --kill-after=15s 7200s /nix/store/23zk8sgzamrbmj1fday15szf7f2279s8-nix-2.34.7/bin/nix --extra-experimental-features nix-command --extra-experimental-features flakes --log-format internal-json build --no-link --print-out-paths git+https://github.com/NorfairKing/schema-dot-org?ref=typed-scenario-paths&rev=d9ffa90ad3a770891245de7773a9c3d589047622&shallow=1#checks.x86_64-linux.jsonld --print-build-logs
  2. 1.61 s
  3. 5.31 s Downloading cached sydtest-discover-0.0.0.4-doc from https://cache.staging.nix-ci.com
  4. 5.31 s Downloading cached fast-myers-diff-0.0.1-doc from https://cache.staging.nix-ci.com
  5. 5.31 s Downloading cached validity-0.12.1.0-doc from https://cache.staging.nix-ci.com
  6. 8.34 s Downloaded cached sydtest-discover-0.0.0.4-doc (282 KiB) in 3.0s
  7. 8.34 s Progress: 0 of 5 built, 1 of 40 downloaded from cache (2 downloading)
  8. 8.34 s Downloading cached sydtest-discover from https://cache.staging.nix-ci.com
  9. 8.35 s Downloaded cached validity-0.12.1.0-doc (849 KiB) in 3.0s
  10. 8.35 s Progress: 0 of 5 built, 2 of 40 downloaded from cache (2 downloading)
  11. 8.35 s Downloading cached validity-bytestring-0.4.1.1-doc from https://cache.staging.nix-ci.com
  12. 8.35 s Downloading cached validity-containers-0.5.0.5-doc from https://cache.staging.nix-ci.com
  13. 8.35 s Downloading cached validity-scientific-0.2.0.3-doc from https://cache.staging.nix-ci.com
  14. 8.35 s Downloading cached validity-text-0.3.1.3-doc from https://cache.staging.nix-ci.com
  15. 8.35 s Downloading cached validity-unordered-containers-0.2.0.3-doc from https://cache.staging.nix-ci.com
  16. 8.35 s Downloading cached validity-vector-0.2.0.3-doc from https://cache.staging.nix-ci.com
  17. 8.35 s Downloading cached validity from https://cache.staging.nix-ci.com
  18. 8.35 s Downloaded cached fast-myers-diff-0.0.1-doc (497 KiB) in 3.0s
  19. 8.35 s Progress: 0 of 5 built, 3 of 40 downloaded from cache (8 downloading)
  20. 8.35 s Downloading cached fast-myers-diff from https://cache.staging.nix-ci.com
  21. 9.92 s Downloaded cached validity-containers-0.5.0.5-doc (218 KiB) in 1.5s
  22. 9.92 s Progress: 0 of 5 built, 4 of 40 downloaded from cache (8 downloading)
  23. 9.95 s Downloaded cached validity-bytestring-0.4.1.1-doc (162 KiB) in 1.5s
  24. 9.95 s Progress: 0 of 5 built, 5 of 40 downloaded from cache (7 downloading)
  25. 9.96 s Downloaded cached validity-text-0.3.1.3-doc (184 KiB) in 1.6s
  26. 9.96 s Downloaded cached validity-scientific-0.2.0.3-doc (146 KiB) in 1.6s
  27. 9.96 s Progress: 0 of 5 built, 6 of 40 downloaded from cache (6 downloading)
  28. 9.96 s Progress: 0 of 5 built, 7 of 40 downloaded from cache (6 downloading)
  29. 9.96 s Downloading cached safe-coloured-text-0.3.0.2-doc from https://cache.staging.nix-ci.com
  30. 9.96 s Downloading cached autodocodec-0.5.0.0-doc from https://cache.staging.nix-ci.com
  31. 9.98 s Downloaded cached validity-vector-0.2.0.3-doc (155 KiB) in 1.6s
  32. 9.98 s Downloaded cached validity-unordered-containers-0.2.0.3-doc (164 KiB) in 1.6s
  33. 9.98 s Progress: 0 of 5 built, 8 of 40 downloaded from cache (6 downloading)
  34. 9.98 s Progress: 0 of 5 built, 9 of 40 downloaded from cache (5 downloading)
  35. 9.98 s Downloading cached validity-aeson-0.2.0.5-doc from https://cache.staging.nix-ci.com
  36. 10.00 s Downloaded cached safe-coloured-text-0.3.0.2-doc (1.1 MiB) in 48ms
  37. 10.00 s Progress: 0 of 5 built, 10 of 40 downloaded from cache (5 downloading)
  38. 10.00 s Downloading cached safe-coloured-text-layout-0.2.0.1-doc from https://cache.staging.nix-ci.com
  39. 10.00 s Downloading cached safe-coloured-text-terminfo-0.3.0.0-doc from https://cache.staging.nix-ci.com
  40. 10.69 s Downloaded cached validity (1.5 MiB) in 2.3s
  41. 10.69 s Progress: 0 of 5 built, 11 of 40 downloaded from cache (6 downloading)
  42. 10.69 s Downloading cached validity-bytestring from https://cache.staging.nix-ci.com
  43. 10.69 s Downloading cached validity-containers from https://cache.staging.nix-ci.com
  44. 10.69 s Downloading cached validity-scientific from https://cache.staging.nix-ci.com
  45. 10.69 s Downloading cached validity-text from https://cache.staging.nix-ci.com
  46. 10.69 s Downloading cached validity-unordered-containers from https://cache.staging.nix-ci.com
  47. 10.69 s Downloading cached validity-vector from https://cache.staging.nix-ci.com
  48. 10.69 s Downloaded cached fast-myers-diff (1.4 MiB) in 2.3s
  49. 10.69 s Progress: 0 of 5 built, 12 of 40 downloaded from cache (11 downloading)
  50. 12.51 s Downloaded cached sydtest-discover (3.8 MiB) in 4.1s
  51. 12.51 s Progress: 0 of 5 built, 13 of 40 downloaded from cache (10 downloading)
  52. 12.65 s Downloaded cached validity-aeson-0.2.0.5-doc (178 KiB) in 2.6s
  53. 12.65 s Progress: 0 of 4 built, 14 of 40 downloaded from cache (9 downloading)
  54. 12.66 s Downloaded cached safe-coloured-text-layout-0.2.0.1-doc (291 KiB) in 2.6s
  55. 12.66 s Progress: 0 of 4 built, 15 of 40 downloaded from cache (8 downloading)
  56. 12.67 s Downloaded cached safe-coloured-text-terminfo-0.3.0.0-doc (197 KiB) in 2.6s
  57. 12.67 s Progress: 0 of 4 built, 16 of 40 downloaded from cache (7 downloading)
  58. 13.57 s Downloaded cached validity-scientific (291 KiB) in 2.8s
  59. 13.57 s Progress: 0 of 4 built, 17 of 40 downloaded from cache (6 downloading)
  60. 13.57 s Downloaded cached validity-containers (606 KiB) in 2.8s
  61. 13.57 s Progress: 0 of 4 built, 18 of 40 downloaded from cache (5 downloading)
  62. 13.58 s Downloaded cached autodocodec-0.5.0.0-doc (2.8 MiB) in 3.6s
  63. 13.58 s Progress: 0 of 4 built, 19 of 40 downloaded from cache (4 downloading)
  64. 13.58 s Downloading cached autodocodec from https://cache.staging.nix-ci.com
  65. 13.58 s Downloading cached autodocodec-nix-0.1.0.0-doc from https://cache.staging.nix-ci.com
  66. 13.58 s Downloading cached autodocodec-schema-0.2.0.1-doc from https://cache.staging.nix-ci.com
  67. 13.58 s Downloaded cached validity-vector (349 KiB) in 2.8s
  68. 13.58 s Progress: 0 of 4 built, 20 of 40 downloaded from cache (6 downloading)
  69. 14.45 s Downloaded cached validity-unordered-containers (402 KiB) in 3.7s
  70. 14.45 s Progress: 0 of 4 built, 21 of 40 downloaded from cache (5 downloading)
  71. 14.46 s Downloaded cached validity-bytestring (342 KiB) in 3.7s
  72. 14.46 s Progress: 0 of 4 built, 22 of 40 downloaded from cache (4 downloading)
  73. 14.47 s Downloaded cached validity-text (420 KiB) in 3.7s
  74. 14.52 s Progress: 0 of 4 built, 23 of 40 downloaded from cache (3 downloading)
  75. 14.52 s Downloading cached validity-aeson from https://cache.staging.nix-ci.com
  76. 14.53 s Downloading cached safe-coloured-text from https://cache.staging.nix-ci.com
  77. 17.41 s Downloaded cached autodocodec-nix-0.1.0.0-doc (649 KiB) in 3.8s
  78. 17.41 s Progress: 0 of 4 built, 24 of 40 downloaded from cache (4 downloading)
  79. 17.41 s Downloaded cached autodocodec-schema-0.2.0.1-doc (741 KiB) in 3.8s
  80. 17.41 s Progress: 0 of 4 built, 25 of 40 downloaded from cache (3 downloading)
  81. 17.41 s Downloading cached autodocodec-yaml-0.4.0.2-doc from https://cache.staging.nix-ci.com
  82. 18.22 s Downloaded cached validity-aeson (409 KiB) in 3.7s
  83. 18.22 s Progress: 0 of 4 built, 26 of 40 downloaded from cache (3 downloading)
  84. 19.86 s Downloaded cached safe-coloured-text (4.1 MiB) in 5.3s
  85. 19.86 s Progress: 0 of 4 built, 27 of 40 downloaded from cache (2 downloading)
  86. 19.86 s Downloading cached safe-coloured-text-terminfo from https://cache.staging.nix-ci.com
  87. 19.86 s Downloading cached safe-coloured-text-layout from https://cache.staging.nix-ci.com
  88. 19.86 s Downloaded cached autodocodec (5.7 MiB) in 6.2s
  89. 19.86 s Progress: 0 of 4 built, 28 of 40 downloaded from cache (3 downloading)
  90. 19.86 s Downloading cached autodocodec-nix from https://cache.staging.nix-ci.com
  91. 19.86 s Downloading cached autodocodec-schema from https://cache.staging.nix-ci.com
  92. 21.51 s Downloaded cached autodocodec-yaml-0.4.0.2-doc (536 KiB) in 4.0s
  93. 21.51 s Progress: 0 of 4 built, 29 of 40 downloaded from cache (4 downloading)
  94. 21.51 s Downloading cached opt-env-conf-0.9.0.0-doc from https://cache.staging.nix-ci.com
  95. 22.34 s Downloaded cached safe-coloured-text-layout (836 KiB) in 2.4s
  96. 22.34 s Progress: 0 of 4 built, 30 of 40 downloaded from cache (4 downloading)
  97. 22.35 s Downloaded cached autodocodec-nix (2.3 MiB) in 2.4s
  98. 22.35 s Progress: 0 of 4 built, 31 of 40 downloaded from cache (3 downloading)
  99. 22.36 s Downloaded cached safe-coloured-text-terminfo (458 KiB) in 2.5s
  100. 22.36 s Progress: 0 of 4 built, 32 of 40 downloaded from cache (2 downloading)
  101. 23.12 s Downloaded cached autodocodec-schema (3.4 MiB) in 3.2s
  102. 23.12 s Progress: 0 of 4 built, 33 of 40 downloaded from cache (1 downloading)
  103. 23.13 s Downloading cached autodocodec-yaml from https://cache.staging.nix-ci.com
  104. 24.74 s Downloaded cached opt-env-conf-0.9.0.0-doc (5.3 MiB) in 3.2s
  105. 24.74 s Progress: 0 of 4 built, 34 of 40 downloaded from cache (1 downloading)
  106. 24.74 s Downloading cached sydtest-0.20.0.1-doc from https://cache.staging.nix-ci.com
  107. 27.09 s Downloaded cached autodocodec-yaml (1.3 MiB) in 3.9s
  108. 27.09 s Progress: 0 of 4 built, 35 of 40 downloaded from cache (1 downloading)
  109. 27.09 s Downloading cached opt-env-conf from https://cache.staging.nix-ci.com
  110. 28.70 s Downloaded cached sydtest-0.20.0.1-doc (6.3 MiB) in 3.9s
  111. 28.70 s Progress: 0 of 4 built, 36 of 40 downloaded from cache (1 downloading)
  112. 28.71 s Downloading cached sydtest-aeson-0.2.0.1-doc from https://cache.staging.nix-ci.com
  113. 30.40 s Downloaded cached sydtest-aeson-0.2.0.1-doc (208 KiB) in 1.6s
  114. 30.40 s Progress: 0 of 4 built, 37 of 40 downloaded from cache (1 downloading)
  115. 36.57 s Downloaded cached opt-env-conf (16.1 MiB) in 9.4s
  116. 36.57 s Progress: 0 of 4 built, 38 of 40 downloaded from cache
  117. 36.58 s Downloading cached sydtest from https://cache.staging.nix-ci.com
  118. 43.01 s Downloaded cached sydtest (17 MiB) in 6.4s
  119. 43.01 s Progress: 0 of 4 built, 39 of 40 downloaded from cache
  120. 43.01 s Downloading cached sydtest-aeson from https://cache.staging.nix-ci.com
  121. 45.39 s Downloaded cached sydtest-aeson (499 KiB) in 2.3s
  122. 45.39 s Progress: 0 of 3 built, 40 of 40 downloaded from cache
  123. 45.48 s Building /nix/store/i9mqc488agky8im8qii1n1jcg4s1k4wr-schema-dot-org-jsonld-source-0.0.0.0.drv
  124. 45.77 s [schema-dot-org-jsonld-source] Phase: setupCompilerEnvironmentPhase
  125. 45.78 s [schema-dot-org-jsonld-source] Build with /nix/store/k493jzz83044mqayvlb6247l35780kxy-ghc-9.10.3.
  126. 46.41 s [schema-dot-org-jsonld-source] Phase: unpackPhase
  127. 46.42 s [schema-dot-org-jsonld-source] unpacking source archive /nix/store/j94wq9p0incpvarvwcq6k8mkld5jpr00-schema-dot-org-jsonld
  128. 46.43 s [schema-dot-org-jsonld-source] source root is schema-dot-org-jsonld
  129. 46.44 s [schema-dot-org-jsonld-source] Phase: patchPhase
  130. 46.45 s [schema-dot-org-jsonld-source] Phase: compileBuildDriverPhase
  131. 46.46 s [schema-dot-org-jsonld-source] setupCompileFlags: -package-db=/build/tmp.cPNTXIJyfa/setup-package.conf.d -threaded
  132. 46.50 s [schema-dot-org-jsonld-source] [1 of 2] Compiling Main ( /nix/store/4mdp8nhyfddh7bllbi7xszz7k9955n79-Setup.hs, /build/tmp.cPNTXIJyfa/Main.o )
  133. 46.54 s [schema-dot-org-jsonld-source] [2 of 2] Linking Setup
  134. 47.67 s [schema-dot-org-jsonld-source] Phase: updateAutotoolsGnuConfigScriptsPhase
  135. 47.69 s [schema-dot-org-jsonld-source] Phase: configurePhase
  136. 47.70 s [schema-dot-org-jsonld-source] configureFlags: --verbose --prefix=/nix/store/9q5dm03axrmxqhm6x7iqpyv5947n8j8l-schema-dot-org-jsonld-source-0.0.0.0 --libdir=$prefix/lib/$compiler/lib --libsubdir=$abi/$libname --docdir=/share/doc/schema-dot-org-jsonld-0.0.0.0 --with-gcc=gcc --package-db=/build/tmp.cPNTXIJyfa/package.conf.d --ghc-option=-j14 --ghc-option=+RTS --ghc-option=-A64M --ghc-option=-RTS --enable-library-profiling --profiling-detail=exported-functions --disable-profiling --enable-shared --disable-coverage --enable-static --disable-executable-dynamic --enable-tests --disable-benchmarks --enable-library-vanilla --disable-library-for-ghci --enable-split-sections --enable-library-stripping --enable-executable-stripping --ghc-option=-haddock --ghc-option=-Wall --ghc-option=-Werror --extra-lib-dirs=/nix/store/wl2nw5l4x4dg6kclbgpq7v9212i1s6cy-ncurses-6.6/lib --extra-lib-dirs=/nix/store/2zs4bbi72plfm8j6zxf1js4f3yc4yzwy-libffi-3.5.2/lib --extra-lib-dirs=/nix/store/qhmqdg27kcrlkl8ida6d5hiacw0y8d21-elfutils-0.194/lib --extra-lib-dirs=/nix/store/y56aqb1m3y5davn6hsv4jfbml78qw4mv-gmp-with-cxx-6.3.0/lib --extra-lib-dirs=/nix/store/wjfhh11sfcdf97mvg7hbxickybxzk850-numactl-2.0.18/lib
  137. 47.71 s [schema-dot-org-jsonld-source] Using Parsec parser
  138. 47.71 s [schema-dot-org-jsonld-source] Configuring schema-dot-org-jsonld-0.0.0.0...
  139. 48.40 s [schema-dot-org-jsonld-source] Dependency aeson: using aeson-2.2.4.1
  140. 48.40 s [schema-dot-org-jsonld-source] Dependency base >=4.7 && <5: using base-4.20.2.0
  141. 48.40 s [schema-dot-org-jsonld-source] Dependency bytestring: using bytestring-0.12.2.0
  142. 48.40 s [schema-dot-org-jsonld-source] Dependency schema-dot-org: using schema-dot-org-0.0.0.0
  143. 48.40 s [schema-dot-org-jsonld-source] Dependency tagsoup: using tagsoup-0.14.8
  144. 48.40 s [schema-dot-org-jsonld-source] Dependency text: using text-2.1.3
  145. 48.40 s [schema-dot-org-jsonld-source] Dependency vector: using vector-0.13.2.0
  146. 48.40 s [schema-dot-org-jsonld-source] Dependency aeson: using aeson-2.2.4.1
  147. 48.40 s [schema-dot-org-jsonld-source] Dependency base >=4.7 && <5: using base-4.20.2.0
  148. 48.40 s [schema-dot-org-jsonld-source] Dependency bytestring: using bytestring-0.12.2.0
  149. 48.40 s [schema-dot-org-jsonld-source] Dependency path: using path-0.9.6
  150. 48.40 s [schema-dot-org-jsonld-source] Dependency schema-dot-org-jsonld: using schema-dot-org-jsonld-0.0.0.0
  151. 48.40 s [schema-dot-org-jsonld-source] Dependency sydtest: using sydtest-0.20.0.1
  152. 48.40 s [schema-dot-org-jsonld-source] Dependency sydtest-aeson: using sydtest-aeson-0.2.0.1
  153. 48.40 s [schema-dot-org-jsonld-source] Source component graph:
  154. 48.40 s [schema-dot-org-jsonld-source] component lib
  155. 48.40 s [schema-dot-org-jsonld-source] component test:schema-dot-org-jsonld-test dependency lib
  156. 48.40 s [schema-dot-org-jsonld-source] Configured component graph:
  157. 48.40 s [schema-dot-org-jsonld-source] component schema-dot-org-jsonld-0.0.0.0-IFXBqy7zHoeF7tncdo1uxB
  158. 48.40 s [schema-dot-org-jsonld-source] include aeson-2.2.4.1-I5kgiCyiPJO8jEV0bEgUez
  159. 48.40 s [schema-dot-org-jsonld-source] include base-4.20.2.0-4d66
  160. 48.40 s [schema-dot-org-jsonld-source] include bytestring-0.12.2.0-25ef
  161. 48.40 s [schema-dot-org-jsonld-source] include schema-dot-org-0.0.0.0-DK3bNdhkDmvFOAaebGqsq5
  162. 48.40 s [schema-dot-org-jsonld-source] include tagsoup-0.14.8-BsqbPSEZh9W5mB1CzgSWho
  163. 48.40 s [schema-dot-org-jsonld-source] include text-2.1.3-3f03
  164. 48.40 s [schema-dot-org-jsonld-source] include vector-0.13.2.0-4sNODSde54Y5T3xVFmV0fE
  165. 48.40 s [schema-dot-org-jsonld-source] component schema-dot-org-jsonld-0.0.0.0-Cu5ewoR91fM6pMI6cAFpDW-schema-dot-org-jsonld-test
  166. 48.40 s [schema-dot-org-jsonld-source] include aeson-2.2.4.1-I5kgiCyiPJO8jEV0bEgUez
  167. 48.40 s [schema-dot-org-jsonld-source] include base-4.20.2.0-4d66
  168. 48.40 s [schema-dot-org-jsonld-source] include bytestring-0.12.2.0-25ef
  169. 48.40 s [schema-dot-org-jsonld-source] include path-0.9.6-L3t3TcndY3P7bshtU9371n
  170. 48.40 s [schema-dot-org-jsonld-source] include schema-dot-org-jsonld-0.0.0.0-IFXBqy7zHoeF7tncdo1uxB
  171. 48.40 s [schema-dot-org-jsonld-source] include sydtest-0.20.0.1-Jo2KtBwwg0M2hH86LVxxcs
  172. 48.40 s [schema-dot-org-jsonld-source] include sydtest-aeson-0.2.0.1-AEtebtKhgEIKIZK2rvdpfT
  173. 48.40 s [schema-dot-org-jsonld-source] Linked component graph:
  174. 48.40 s [schema-dot-org-jsonld-source] unit schema-dot-org-jsonld-0.0.0.0-IFXBqy7zHoeF7tncdo1uxB
  175. 48.40 s [schema-dot-org-jsonld-source] include aeson-2.2.4.1-I5kgiCyiPJO8jEV0bEgUez
  176. 48.40 s [schema-dot-org-jsonld-source] include base-4.20.2.0-4d66
  177. 48.40 s [schema-dot-org-jsonld-source] include bytestring-0.12.2.0-25ef
  178. 48.40 s [schema-dot-org-jsonld-source] include schema-dot-org-0.0.0.0-DK3bNdhkDmvFOAaebGqsq5
  179. 48.40 s [schema-dot-org-jsonld-source] include tagsoup-0.14.8-BsqbPSEZh9W5mB1CzgSWho
  180. 48.40 s [schema-dot-org-jsonld-source] include text-2.1.3-3f03
  181. 48.40 s [schema-dot-org-jsonld-source] include vector-0.13.2.0-4sNODSde54Y5T3xVFmV0fE
  182. 48.40 s [schema-dot-org-jsonld-source] SchemaDotOrg.JSONLD=schema-dot-org-jsonld-0.0.0.0-IFXBqy7zHoeF7tncdo1uxB:SchemaDotOrg.JSONLD,SchemaDotOrg.JSONLD.Parse=schema-dot-org-jsonld-0.0.0.0-IFXBqy7zHoeF7tncdo1uxB:SchemaDotOrg.JSONLD.Parse,SchemaDotOrg.JSONLD.Render=schema-dot-org-jsonld-0.0.0.0-IFXBqy7zHoeF7tncdo1uxB:SchemaDotOrg.JSONLD.Render,SchemaDotOrg.JSONLD.Tagsoup=schema-dot-org-jsonld-0.0.0.0-IFXBqy7zHoeF7tncdo1uxB:SchemaDotOrg.JSONLD.Tagsoup
  183. 48.40 s [schema-dot-org-jsonld-source] unit schema-dot-org-jsonld-0.0.0.0-Cu5ewoR91fM6pMI6cAFpDW-schema-dot-org-jsonld-test
  184. 48.40 s [schema-dot-org-jsonld-source] include aeson-2.2.4.1-I5kgiCyiPJO8jEV0bEgUez
  185. 48.40 s [schema-dot-org-jsonld-source] include base-4.20.2.0-4d66
  186. 48.40 s [schema-dot-org-jsonld-source] include bytestring-0.12.2.0-25ef
  187. 48.40 s [schema-dot-org-jsonld-source] include path-0.9.6-L3t3TcndY3P7bshtU9371n
  188. 48.40 s [schema-dot-org-jsonld-source] include schema-dot-org-jsonld-0.0.0.0-IFXBqy7zHoeF7tncdo1uxB
  189. 48.40 s [schema-dot-org-jsonld-source] include sydtest-0.20.0.1-Jo2KtBwwg0M2hH86LVxxcs
  190. 48.40 s [schema-dot-org-jsonld-source] include sydtest-aeson-0.2.0.1-AEtebtKhgEIKIZK2rvdpfT
  191. 48.40 s [schema-dot-org-jsonld-source] Ready component graph:
  192. 48.40 s [schema-dot-org-jsonld-source] definite schema-dot-org-jsonld-0.0.0.0-IFXBqy7zHoeF7tncdo1uxB
  193. 48.40 s [schema-dot-org-jsonld-source] depends aeson-2.2.4.1-I5kgiCyiPJO8jEV0bEgUez
  194. 48.40 s [schema-dot-org-jsonld-source] depends base-4.20.2.0-4d66
  195. 48.40 s [schema-dot-org-jsonld-source] depends bytestring-0.12.2.0-25ef
  196. 48.40 s [schema-dot-org-jsonld-source] depends schema-dot-org-0.0.0.0-DK3bNdhkDmvFOAaebGqsq5
  197. 48.40 s [schema-dot-org-jsonld-source] depends tagsoup-0.14.8-BsqbPSEZh9W5mB1CzgSWho
  198. 48.40 s [schema-dot-org-jsonld-source] depends text-2.1.3-3f03
  199. 48.40 s [schema-dot-org-jsonld-source] depends vector-0.13.2.0-4sNODSde54Y5T3xVFmV0fE
  200. 48.40 s [schema-dot-org-jsonld-source] definite schema-dot-org-jsonld-0.0.0.0-Cu5ewoR91fM6pMI6cAFpDW-schema-dot-org-jsonld-test
  201. 48.40 s [schema-dot-org-jsonld-source] depends aeson-2.2.4.1-I5kgiCyiPJO8jEV0bEgUez
  202. 48.40 s [schema-dot-org-jsonld-source] depends base-4.20.2.0-4d66
  203. 48.40 s [schema-dot-org-jsonld-source] depends bytestring-0.12.2.0-25ef
  204. 48.40 s [schema-dot-org-jsonld-source] depends path-0.9.6-L3t3TcndY3P7bshtU9371n
  205. 48.40 s [schema-dot-org-jsonld-source] depends schema-dot-org-jsonld-0.0.0.0-IFXBqy7zHoeF7tncdo1uxB
  206. 48.40 s [schema-dot-org-jsonld-source] depends sydtest-0.20.0.1-Jo2KtBwwg0M2hH86LVxxcs
  207. 48.40 s [schema-dot-org-jsonld-source] depends sydtest-aeson-0.2.0.1-AEtebtKhgEIKIZK2rvdpfT
  208. 48.40 s [schema-dot-org-jsonld-source] Using Cabal-3.12.1.0 compiled by ghc-9.10
  209. 48.40 s [schema-dot-org-jsonld-source] Using compiler: ghc-9.10.3
  210. 48.40 s [schema-dot-org-jsonld-source] Using install prefix:
  211. 48.40 s [schema-dot-org-jsonld-source] /nix/store/9q5dm03axrmxqhm6x7iqpyv5947n8j8l-schema-dot-org-jsonld-source-0.0.0.0
  212. 48.40 s [schema-dot-org-jsonld-source] Executables installed in:
  213. 48.40 s [schema-dot-org-jsonld-source] /nix/store/9q5dm03axrmxqhm6x7iqpyv5947n8j8l-schema-dot-org-jsonld-source-0.0.0.0/bin
  214. 48.40 s [schema-dot-org-jsonld-source] Libraries installed in:
  215. 48.40 s [schema-dot-org-jsonld-source] /nix/store/9q5dm03axrmxqhm6x7iqpyv5947n8j8l-schema-dot-org-jsonld-source-0.0.0.0/lib/ghc-9.10.3/lib/x86_64-linux-ghc-9.10.3-21af/schema-dot-org-jsonld-0.0.0.0-IFXBqy7zHoeF7tncdo1uxB
  216. 48.40 s [schema-dot-org-jsonld-source] Dynamic Libraries installed in:
  217. 48.40 s [schema-dot-org-jsonld-source] /nix/store/9q5dm03axrmxqhm6x7iqpyv5947n8j8l-schema-dot-org-jsonld-source-0.0.0.0/lib/ghc-9.10.3/lib/x86_64-linux-ghc-9.10.3-21af
  218. 48.40 s [schema-dot-org-jsonld-source] Private executables installed in:
  219. 48.40 s [schema-dot-org-jsonld-source] /nix/store/9q5dm03axrmxqhm6x7iqpyv5947n8j8l-schema-dot-org-jsonld-source-0.0.0.0/libexec/x86_64-linux-ghc-9.10.3-21af/schema-dot-org-jsonld-0.0.0.0
  220. 48.40 s [schema-dot-org-jsonld-source] Data files installed in:
  221. 48.40 s [schema-dot-org-jsonld-source] /nix/store/9q5dm03axrmxqhm6x7iqpyv5947n8j8l-schema-dot-org-jsonld-source-0.0.0.0/share/x86_64-linux-ghc-9.10.3-21af/schema-dot-org-jsonld-0.0.0.0
  222. 48.40 s [schema-dot-org-jsonld-source] Documentation installed in: /share/doc/schema-dot-org-jsonld-0.0.0.0
  223. 48.40 s [schema-dot-org-jsonld-source] Configuration files installed in:
  224. 48.40 s [schema-dot-org-jsonld-source] /nix/store/9q5dm03axrmxqhm6x7iqpyv5947n8j8l-schema-dot-org-jsonld-source-0.0.0.0/etc
  225. 48.40 s [schema-dot-org-jsonld-source] No alex found
  226. 48.40 s [schema-dot-org-jsonld-source] Using ar found on system at:
  227. 48.40 s [schema-dot-org-jsonld-source] /nix/store/mbyy19mdwnfvfwmdi0gqgggx0njvpl1w-binutils-wrapper-2.46/bin/ar
  228. 48.40 s [schema-dot-org-jsonld-source] No c2hs found
  229. 48.40 s [schema-dot-org-jsonld-source] No cpphs found
  230. 48.40 s [schema-dot-org-jsonld-source] No doctest found
  231. 48.40 s [schema-dot-org-jsonld-source] Using gcc version 15.2.0 given by user at:
  232. 48.40 s [schema-dot-org-jsonld-source] /nix/store/788mx070y81zjlg5ipcl0cra3afviw9k-gcc-wrapper-15.2.0/bin/gcc
  233. 48.40 s [schema-dot-org-jsonld-source] Using ghc version 9.10.3 found on system at:
  234. 48.40 s [schema-dot-org-jsonld-source] /nix/store/k493jzz83044mqayvlb6247l35780kxy-ghc-9.10.3/bin/ghc
  235. 48.40 s [schema-dot-org-jsonld-source] Using ghc-pkg version 9.10.3 found on system at:
  236. 48.40 s [schema-dot-org-jsonld-source] /nix/store/k493jzz83044mqayvlb6247l35780kxy-ghc-9.10.3/bin/ghc-pkg-9.10.3
  237. 48.40 s [schema-dot-org-jsonld-source] No ghcjs found
  238. 48.40 s [schema-dot-org-jsonld-source] No ghcjs-pkg found
  239. 48.40 s [schema-dot-org-jsonld-source] No greencard found
  240. 48.40 s [schema-dot-org-jsonld-source] Using haddock version 2.31.1 found on system at:
  241. 48.40 s [schema-dot-org-jsonld-source] /nix/store/k493jzz83044mqayvlb6247l35780kxy-ghc-9.10.3/bin/haddock-ghc-9.10.3
  242. 48.40 s [schema-dot-org-jsonld-source] No happy found
  243. 48.40 s [schema-dot-org-jsonld-source] Using haskell-suite found on system at: haskell-suite-dummy-location
  244. 48.40 s [schema-dot-org-jsonld-source] Using haskell-suite-pkg found on system at: haskell-suite-pkg-dummy-location
  245. 48.40 s [schema-dot-org-jsonld-source] No hmake found
  246. 48.40 s [schema-dot-org-jsonld-source] Using hpc version 0.69 found on system at:
  247. 48.40 s [schema-dot-org-jsonld-source] /nix/store/k493jzz83044mqayvlb6247l35780kxy-ghc-9.10.3/bin/hpc-ghc-9.10.3
  248. 48.40 s [schema-dot-org-jsonld-source] Using hsc2hs version 0.68.10 found on system at:
  249. 48.40 s [schema-dot-org-jsonld-source] /nix/store/k493jzz83044mqayvlb6247l35780kxy-ghc-9.10.3/bin/hsc2hs-ghc-9.10.3
  250. 48.40 s [schema-dot-org-jsonld-source] Using hscolour version 1.25 found on system at:
  251. 48.40 s [schema-dot-org-jsonld-source] /nix/store/hvlf3xzdw0p5s3kybdkch6iqyz0740rc-hscolour-1.25/bin/HsColour
  252. 48.40 s [schema-dot-org-jsonld-source] No jhc found
  253. 48.40 s [schema-dot-org-jsonld-source] Using ld found on system at:
  254. 48.40 s [schema-dot-org-jsonld-source] /nix/store/788mx070y81zjlg5ipcl0cra3afviw9k-gcc-wrapper-15.2.0/bin/ld
  255. 48.40 s [schema-dot-org-jsonld-source] No pkg-config found
  256. 48.40 s [schema-dot-org-jsonld-source] Using runghc version 9.10.3 found on system at:
  257. 48.40 s [schema-dot-org-jsonld-source] /nix/store/k493jzz83044mqayvlb6247l35780kxy-ghc-9.10.3/bin/runghc-9.10.3
  258. 48.40 s [schema-dot-org-jsonld-source] Using strip version 2.46 found on system at:
  259. 48.40 s [schema-dot-org-jsonld-source] /nix/store/788mx070y81zjlg5ipcl0cra3afviw9k-gcc-wrapper-15.2.0/bin/strip
  260. 48.40 s [schema-dot-org-jsonld-source] Using tar found on system at:
  261. 48.40 s [schema-dot-org-jsonld-source] /nix/store/k5akwnrn9x2afaj2va7g4a2zpdim8l43-gnutar-1.35/bin/tar
  262. 48.40 s [schema-dot-org-jsonld-source] No uhc found
  263. 49.51 s [schema-dot-org-jsonld-source] Phase: buildPhase
  264. 49.54 s [schema-dot-org-jsonld-source] Distribution quality errors:
  265. 49.54 s [schema-dot-org-jsonld-source] [no-syn-desc] No 'synopsis' or 'description' field.
  266. 49.54 s [schema-dot-org-jsonld-source] [license-none] The 'license' field is missing or is NONE.
  267. 49.54 s [schema-dot-org-jsonld-source] Distribution quality warnings:
  268. 49.54 s [schema-dot-org-jsonld-source] [no-category] No 'category' field.
  269. 49.54 s [schema-dot-org-jsonld-source] [missing-upper-bounds] On library, these packages miss upper bounds:
  270. 49.54 s [schema-dot-org-jsonld-source] - aeson
  271. 49.54 s [schema-dot-org-jsonld-source] - bytestring
  272. 49.54 s [schema-dot-org-jsonld-source] - schema-dot-org
  273. 49.54 s [schema-dot-org-jsonld-source] - tagsoup
  274. 49.54 s [schema-dot-org-jsonld-source] - text
  275. 49.54 s [schema-dot-org-jsonld-source] - vector
  276. 49.54 s [schema-dot-org-jsonld-source] Please add them. There is more information at https://pvp.haskell.org/
  277. 49.54 s [schema-dot-org-jsonld-source] Note: the public hackage server would reject this package.
  278. 49.54 s [schema-dot-org-jsonld-source] Building source dist for schema-dot-org-jsonld-0.0.0.0...
  279. 49.56 s [schema-dot-org-jsonld-source] Source tarball created: dist/schema-dot-org-jsonld-0.0.0.0.tar.gz
  280. 49.61 s [schema-dot-org-jsonld-source] Phase: checkPhase
  281. 49.62 s [schema-dot-org-jsonld-source] Phase: haddockPhase
  282. 49.63 s [schema-dot-org-jsonld-source] Phase: installPhase
  283. 49.65 s [schema-dot-org-jsonld-source] Phase: fixupPhase
  284. 49.68 s [schema-dot-org-jsonld-source:post-build] Uploading to the NixCI staging cache: /nix/store/9q5dm03axrmxqhm6x7iqpyv5947n8j8l-schema-dot-org-jsonld-source-0.0.0.0
  285. 49.72 s [schema-dot-org-jsonld-source:post-build] warning: 'warn-short-path-literals' is deprecated, use 'lint-short-path-literals = ignore' instead
  286. 49.72 s [schema-dot-org-jsonld-source:post-build] copying 1 paths...
  287. 49.72 s [schema-dot-org-jsonld-source:post-build] copying path '/nix/store/9q5dm03axrmxqhm6x7iqpyv5947n8j8l-schema-dot-org-jsonld-source-0.0.0.0' to 'https://cache.staging.nix-ci.com'...
  288. 53.78 s [schema-dot-org-jsonld-source:post-build] warning: 'warn-short-path-literals' is deprecated, use 'lint-short-path-literals = ignore' instead
  289. 54.03 s [schema-dot-org-jsonld-source:post-build] copying 2 paths...
  290. 54.03 s [schema-dot-org-jsonld-source:post-build] copying path '/nix/store/j94wq9p0incpvarvwcq6k8mkld5jpr00-schema-dot-org-jsonld' to 'https://cache.staging.nix-ci.com'...
  291. 56.49 s [schema-dot-org-jsonld-source:post-build] copying path '/nix/store/i9mqc488agky8im8qii1n1jcg4s1k4wr-schema-dot-org-jsonld-source-0.0.0.0.drv' to 'https://cache.staging.nix-ci.com'...
  292. 61.21 s Uploaded schema-dot-org-jsonld-source in 11.5s
  293. 61.21 s Progress: 1 of 3 built, 40 of 40 downloaded from cache
  294. 61.21 s Built schema-dot-org-jsonld-source in 15.7s
  295. 61.25 s Building /nix/store/b7wxkz1av6hmgals5h16625kcxfjpvyg-schema-dot-org-jsonld-0.0.0.0.drv
  296. 61.55 s [schema-dot-org-jsonld] Phase: setupCompilerEnvironmentPhase
  297. 61.55 s [schema-dot-org-jsonld] Build with /nix/store/k493jzz83044mqayvlb6247l35780kxy-ghc-9.10.3.
  298. 62.22 s [schema-dot-org-jsonld] Phase: unpackPhase
  299. 62.23 s [schema-dot-org-jsonld] unpacking source archive /nix/store/9q5dm03axrmxqhm6x7iqpyv5947n8j8l-schema-dot-org-jsonld-source-0.0.0.0/schema-dot-org-jsonld-0.0.0.0.tar.gz
  300. 62.24 s [schema-dot-org-jsonld] source root is schema-dot-org-jsonld-0.0.0.0
  301. 62.26 s [schema-dot-org-jsonld] setting SOURCE_DATE_EPOCH to timestamp 1788936908 of file "schema-dot-org-jsonld-0.0.0.0/test/Spec.hs"
  302. 62.26 s [schema-dot-org-jsonld] warning: file "schema-dot-org-jsonld-0.0.0.0/test/Spec.hs" may be generated; SOURCE_DATE_EPOCH may be non-deterministic
  303. 62.27 s [schema-dot-org-jsonld] Phase: patchPhase
  304. 62.29 s [schema-dot-org-jsonld] Phase: compileBuildDriverPhase
  305. 62.29 s [schema-dot-org-jsonld] setupCompileFlags: -package-db=/build/tmp.utuxe2in0F/setup-package.conf.d -threaded
  306. 62.34 s [schema-dot-org-jsonld] [1 of 2] Compiling Main ( Setup.hs, /build/tmp.utuxe2in0F/Main.o )
  307. 62.38 s [schema-dot-org-jsonld] [2 of 2] Linking Setup
  308. 63.50 s [schema-dot-org-jsonld] Phase: updateAutotoolsGnuConfigScriptsPhase
  309. 63.52 s [schema-dot-org-jsonld] Phase: configurePhase
  310. 63.53 s [schema-dot-org-jsonld] configureFlags: --verbose --prefix=/nix/store/8q2s09jza1l7wqhq4i0sqrkqmsx0ldiz-schema-dot-org-jsonld-0.0.0.0 --libdir=$prefix/lib/$compiler/lib --libsubdir=$abi/$libname --docdir=/nix/store/nicsxijpgvgpw191gz23d9r192p566w0-schema-dot-org-jsonld-0.0.0.0-doc/share/doc/schema-dot-org-jsonld-0.0.0.0 --with-gcc=gcc --package-db=/build/tmp.utuxe2in0F/package.conf.d --ghc-option=-j14 --ghc-option=+RTS --ghc-option=-A64M --ghc-option=-RTS --enable-library-profiling --profiling-detail=exported-functions --disable-profiling --enable-shared --disable-coverage --enable-static --disable-executable-dynamic --enable-tests --disable-benchmarks --enable-library-vanilla --disable-library-for-ghci --enable-split-sections --enable-library-stripping --enable-executable-stripping --ghc-option=-haddock --ghc-option=-Wall --ghc-option=-Werror --extra-lib-dirs=/nix/store/wl2nw5l4x4dg6kclbgpq7v9212i1s6cy-ncurses-6.6/lib --extra-lib-dirs=/nix/store/2zs4bbi72plfm8j6zxf1js4f3yc4yzwy-libffi-3.5.2/lib --extra-lib-dirs=/nix/store/qhmqdg27kcrlkl8ida6d5hiacw0y8d21-elfutils-0.194/lib --extra-lib-dirs=/nix/store/y56aqb1m3y5davn6hsv4jfbml78qw4mv-gmp-with-cxx-6.3.0/lib --extra-lib-dirs=/nix/store/wjfhh11sfcdf97mvg7hbxickybxzk850-numactl-2.0.18/lib
  311. 63.54 s [schema-dot-org-jsonld] Using Parsec parser
  312. 63.54 s [schema-dot-org-jsonld] Configuring schema-dot-org-jsonld-0.0.0.0...
  313. 64.25 s [schema-dot-org-jsonld] Dependency aeson: using aeson-2.2.4.1
  314. 64.25 s [schema-dot-org-jsonld] Dependency base >=4.7 && <5: using base-4.20.2.0
  315. 64.25 s [schema-dot-org-jsonld] Dependency bytestring: using bytestring-0.12.2.0
  316. 64.25 s [schema-dot-org-jsonld] Dependency schema-dot-org: using schema-dot-org-0.0.0.0
  317. 64.25 s [schema-dot-org-jsonld] Dependency tagsoup: using tagsoup-0.14.8
  318. 64.25 s [schema-dot-org-jsonld] Dependency text: using text-2.1.3
  319. 64.25 s [schema-dot-org-jsonld] Dependency vector: using vector-0.13.2.0
  320. 64.25 s [schema-dot-org-jsonld] Dependency aeson: using aeson-2.2.4.1
  321. 64.25 s [schema-dot-org-jsonld] Dependency base >=4.7 && <5: using base-4.20.2.0
  322. 64.25 s [schema-dot-org-jsonld] Dependency bytestring: using bytestring-0.12.2.0
  323. 64.25 s [schema-dot-org-jsonld] Dependency path: using path-0.9.6
  324. 64.25 s [schema-dot-org-jsonld] Dependency schema-dot-org-jsonld: using schema-dot-org-jsonld-0.0.0.0
  325. 64.25 s [schema-dot-org-jsonld] Dependency sydtest: using sydtest-0.20.0.1
  326. 64.25 s [schema-dot-org-jsonld] Dependency sydtest-aeson: using sydtest-aeson-0.2.0.1
  327. 64.25 s [schema-dot-org-jsonld] Source component graph:
  328. 64.25 s [schema-dot-org-jsonld] component lib
  329. 64.25 s [schema-dot-org-jsonld] component test:schema-dot-org-jsonld-test dependency lib
  330. 64.25 s [schema-dot-org-jsonld] Configured component graph:
  331. 64.25 s [schema-dot-org-jsonld] component schema-dot-org-jsonld-0.0.0.0-IFXBqy7zHoeF7tncdo1uxB
  332. 64.25 s [schema-dot-org-jsonld] include aeson-2.2.4.1-I5kgiCyiPJO8jEV0bEgUez
  333. 64.25 s [schema-dot-org-jsonld] include base-4.20.2.0-4d66
  334. 64.25 s [schema-dot-org-jsonld] include bytestring-0.12.2.0-25ef
  335. 64.25 s [schema-dot-org-jsonld] include schema-dot-org-0.0.0.0-DK3bNdhkDmvFOAaebGqsq5
  336. 64.25 s [schema-dot-org-jsonld] include tagsoup-0.14.8-BsqbPSEZh9W5mB1CzgSWho
  337. 64.25 s [schema-dot-org-jsonld] include text-2.1.3-3f03
  338. 64.25 s [schema-dot-org-jsonld] include vector-0.13.2.0-4sNODSde54Y5T3xVFmV0fE
  339. 64.25 s [schema-dot-org-jsonld] component schema-dot-org-jsonld-0.0.0.0-Cu5ewoR91fM6pMI6cAFpDW-schema-dot-org-jsonld-test
  340. 64.25 s [schema-dot-org-jsonld] include aeson-2.2.4.1-I5kgiCyiPJO8jEV0bEgUez
  341. 64.25 s [schema-dot-org-jsonld] include base-4.20.2.0-4d66
  342. 64.25 s [schema-dot-org-jsonld] include bytestring-0.12.2.0-25ef
  343. 64.25 s [schema-dot-org-jsonld] include path-0.9.6-L3t3TcndY3P7bshtU9371n
  344. 64.25 s [schema-dot-org-jsonld] include schema-dot-org-jsonld-0.0.0.0-IFXBqy7zHoeF7tncdo1uxB
  345. 64.25 s [schema-dot-org-jsonld] include sydtest-0.20.0.1-Jo2KtBwwg0M2hH86LVxxcs
  346. 64.25 s [schema-dot-org-jsonld] include sydtest-aeson-0.2.0.1-AEtebtKhgEIKIZK2rvdpfT
  347. 64.25 s [schema-dot-org-jsonld] Linked component graph:
  348. 64.25 s [schema-dot-org-jsonld] unit schema-dot-org-jsonld-0.0.0.0-IFXBqy7zHoeF7tncdo1uxB
  349. 64.25 s [schema-dot-org-jsonld] include aeson-2.2.4.1-I5kgiCyiPJO8jEV0bEgUez
  350. 64.25 s [schema-dot-org-jsonld] include base-4.20.2.0-4d66
  351. 64.25 s [schema-dot-org-jsonld] include bytestring-0.12.2.0-25ef
  352. 64.25 s [schema-dot-org-jsonld] include schema-dot-org-0.0.0.0-DK3bNdhkDmvFOAaebGqsq5
  353. 64.25 s [schema-dot-org-jsonld] include tagsoup-0.14.8-BsqbPSEZh9W5mB1CzgSWho
  354. 64.25 s [schema-dot-org-jsonld] include text-2.1.3-3f03
  355. 64.25 s [schema-dot-org-jsonld] include vector-0.13.2.0-4sNODSde54Y5T3xVFmV0fE
  356. 64.25 s [schema-dot-org-jsonld] SchemaDotOrg.JSONLD=schema-dot-org-jsonld-0.0.0.0-IFXBqy7zHoeF7tncdo1uxB:SchemaDotOrg.JSONLD,SchemaDotOrg.JSONLD.Parse=schema-dot-org-jsonld-0.0.0.0-IFXBqy7zHoeF7tncdo1uxB:SchemaDotOrg.JSONLD.Parse,SchemaDotOrg.JSONLD.Render=schema-dot-org-jsonld-0.0.0.0-IFXBqy7zHoeF7tncdo1uxB:SchemaDotOrg.JSONLD.Render,SchemaDotOrg.JSONLD.Tagsoup=schema-dot-org-jsonld-0.0.0.0-IFXBqy7zHoeF7tncdo1uxB:SchemaDotOrg.JSONLD.Tagsoup
  357. 64.25 s [schema-dot-org-jsonld] unit schema-dot-org-jsonld-0.0.0.0-Cu5ewoR91fM6pMI6cAFpDW-schema-dot-org-jsonld-test
  358. 64.25 s [schema-dot-org-jsonld] include aeson-2.2.4.1-I5kgiCyiPJO8jEV0bEgUez
  359. 64.25 s [schema-dot-org-jsonld] include base-4.20.2.0-4d66
  360. 64.25 s [schema-dot-org-jsonld] include bytestring-0.12.2.0-25ef
  361. 64.25 s [schema-dot-org-jsonld] include path-0.9.6-L3t3TcndY3P7bshtU9371n
  362. 64.25 s [schema-dot-org-jsonld] include schema-dot-org-jsonld-0.0.0.0-IFXBqy7zHoeF7tncdo1uxB
  363. 64.25 s [schema-dot-org-jsonld] include sydtest-0.20.0.1-Jo2KtBwwg0M2hH86LVxxcs
  364. 64.25 s [schema-dot-org-jsonld] include sydtest-aeson-0.2.0.1-AEtebtKhgEIKIZK2rvdpfT
  365. 64.25 s [schema-dot-org-jsonld] Ready component graph:
  366. 64.25 s [schema-dot-org-jsonld] definite schema-dot-org-jsonld-0.0.0.0-IFXBqy7zHoeF7tncdo1uxB
  367. 64.25 s [schema-dot-org-jsonld] depends aeson-2.2.4.1-I5kgiCyiPJO8jEV0bEgUez
  368. 64.25 s [schema-dot-org-jsonld] depends base-4.20.2.0-4d66
  369. 64.25 s [schema-dot-org-jsonld] depends bytestring-0.12.2.0-25ef
  370. 64.25 s [schema-dot-org-jsonld] depends schema-dot-org-0.0.0.0-DK3bNdhkDmvFOAaebGqsq5
  371. 64.25 s [schema-dot-org-jsonld] depends tagsoup-0.14.8-BsqbPSEZh9W5mB1CzgSWho
  372. 64.25 s [schema-dot-org-jsonld] depends text-2.1.3-3f03
  373. 64.25 s [schema-dot-org-jsonld] depends vector-0.13.2.0-4sNODSde54Y5T3xVFmV0fE
  374. 64.25 s [schema-dot-org-jsonld] definite schema-dot-org-jsonld-0.0.0.0-Cu5ewoR91fM6pMI6cAFpDW-schema-dot-org-jsonld-test
  375. 64.25 s [schema-dot-org-jsonld] depends aeson-2.2.4.1-I5kgiCyiPJO8jEV0bEgUez
  376. 64.25 s [schema-dot-org-jsonld] depends base-4.20.2.0-4d66
  377. 64.25 s [schema-dot-org-jsonld] depends bytestring-0.12.2.0-25ef
  378. 64.25 s [schema-dot-org-jsonld] depends path-0.9.6-L3t3TcndY3P7bshtU9371n
  379. 64.25 s [schema-dot-org-jsonld] depends schema-dot-org-jsonld-0.0.0.0-IFXBqy7zHoeF7tncdo1uxB
  380. 64.25 s [schema-dot-org-jsonld] depends sydtest-0.20.0.1-Jo2KtBwwg0M2hH86LVxxcs
  381. 64.25 s [schema-dot-org-jsonld] depends sydtest-aeson-0.2.0.1-AEtebtKhgEIKIZK2rvdpfT
  382. 64.25 s [schema-dot-org-jsonld] Using Cabal-3.12.1.0 compiled by ghc-9.10
  383. 64.25 s [schema-dot-org-jsonld] Using compiler: ghc-9.10.3
  384. 64.25 s [schema-dot-org-jsonld] Using install prefix:
  385. 64.25 s [schema-dot-org-jsonld] /nix/store/8q2s09jza1l7wqhq4i0sqrkqmsx0ldiz-schema-dot-org-jsonld-0.0.0.0
  386. 64.25 s [schema-dot-org-jsonld] Executables installed in:
  387. 64.25 s [schema-dot-org-jsonld] /nix/store/8q2s09jza1l7wqhq4i0sqrkqmsx0ldiz-schema-dot-org-jsonld-0.0.0.0/bin
  388. 64.25 s [schema-dot-org-jsonld] Libraries installed in:
  389. 64.25 s [schema-dot-org-jsonld] /nix/store/8q2s09jza1l7wqhq4i0sqrkqmsx0ldiz-schema-dot-org-jsonld-0.0.0.0/lib/ghc-9.10.3/lib/x86_64-linux-ghc-9.10.3-21af/schema-dot-org-jsonld-0.0.0.0-IFXBqy7zHoeF7tncdo1uxB
  390. 64.25 s [schema-dot-org-jsonld] Dynamic Libraries installed in:
  391. 64.25 s [schema-dot-org-jsonld] /nix/store/8q2s09jza1l7wqhq4i0sqrkqmsx0ldiz-schema-dot-org-jsonld-0.0.0.0/lib/ghc-9.10.3/lib/x86_64-linux-ghc-9.10.3-21af
  392. 64.25 s [schema-dot-org-jsonld] Private executables installed in:
  393. 64.25 s [schema-dot-org-jsonld] /nix/store/8q2s09jza1l7wqhq4i0sqrkqmsx0ldiz-schema-dot-org-jsonld-0.0.0.0/libexec/x86_64-linux-ghc-9.10.3-21af/schema-dot-org-jsonld-0.0.0.0
  394. 64.25 s [schema-dot-org-jsonld] Data files installed in:
  395. 64.25 s [schema-dot-org-jsonld] /nix/store/8q2s09jza1l7wqhq4i0sqrkqmsx0ldiz-schema-dot-org-jsonld-0.0.0.0/share/x86_64-linux-ghc-9.10.3-21af/schema-dot-org-jsonld-0.0.0.0
  396. 64.25 s [schema-dot-org-jsonld] Documentation installed in:
  397. 64.25 s [schema-dot-org-jsonld] /nix/store/nicsxijpgvgpw191gz23d9r192p566w0-schema-dot-org-jsonld-0.0.0.0-doc/share/doc/schema-dot-org-jsonld-0.0.0.0
  398. 64.25 s [schema-dot-org-jsonld] Configuration files installed in:
  399. 64.25 s [schema-dot-org-jsonld] /nix/store/8q2s09jza1l7wqhq4i0sqrkqmsx0ldiz-schema-dot-org-jsonld-0.0.0.0/etc
  400. 64.25 s [schema-dot-org-jsonld] No alex found
  401. 64.25 s [schema-dot-org-jsonld] Using ar found on system at:
  402. 64.25 s [schema-dot-org-jsonld] /nix/store/mbyy19mdwnfvfwmdi0gqgggx0njvpl1w-binutils-wrapper-2.46/bin/ar
  403. 64.25 s [schema-dot-org-jsonld] No c2hs found
  404. 64.25 s [schema-dot-org-jsonld] No cpphs found
  405. 64.25 s [schema-dot-org-jsonld] No doctest found
  406. 64.25 s [schema-dot-org-jsonld] Using gcc version 15.2.0 given by user at:
  407. 64.25 s [schema-dot-org-jsonld] /nix/store/788mx070y81zjlg5ipcl0cra3afviw9k-gcc-wrapper-15.2.0/bin/gcc
  408. 64.25 s [schema-dot-org-jsonld] Using ghc version 9.10.3 found on system at:
  409. 64.25 s [schema-dot-org-jsonld] /nix/store/k493jzz83044mqayvlb6247l35780kxy-ghc-9.10.3/bin/ghc
  410. 64.25 s [schema-dot-org-jsonld] Using ghc-pkg version 9.10.3 found on system at:
  411. 64.25 s [schema-dot-org-jsonld] /nix/store/k493jzz83044mqayvlb6247l35780kxy-ghc-9.10.3/bin/ghc-pkg-9.10.3
  412. 64.25 s [schema-dot-org-jsonld] No ghcjs found
  413. 64.25 s [schema-dot-org-jsonld] No ghcjs-pkg found
  414. 64.25 s [schema-dot-org-jsonld] No greencard found
  415. 64.25 s [schema-dot-org-jsonld] Using haddock version 2.31.1 found on system at:
  416. 64.25 s [schema-dot-org-jsonld] /nix/store/k493jzz83044mqayvlb6247l35780kxy-ghc-9.10.3/bin/haddock-ghc-9.10.3
  417. 64.25 s [schema-dot-org-jsonld] No happy found
  418. 64.25 s [schema-dot-org-jsonld] Using haskell-suite found on system at: haskell-suite-dummy-location
  419. 64.25 s [schema-dot-org-jsonld] Using haskell-suite-pkg found on system at: haskell-suite-pkg-dummy-location
  420. 64.25 s [schema-dot-org-jsonld] No hmake found
  421. 64.25 s [schema-dot-org-jsonld] Using hpc version 0.69 found on system at:
  422. 64.25 s [schema-dot-org-jsonld] /nix/store/k493jzz83044mqayvlb6247l35780kxy-ghc-9.10.3/bin/hpc-ghc-9.10.3
  423. 64.25 s [schema-dot-org-jsonld] Using hsc2hs version 0.68.10 found on system at:
  424. 64.25 s [schema-dot-org-jsonld] /nix/store/k493jzz83044mqayvlb6247l35780kxy-ghc-9.10.3/bin/hsc2hs-ghc-9.10.3
  425. 64.25 s [schema-dot-org-jsonld] Using hscolour version 1.25 found on system at:
  426. 64.25 s [schema-dot-org-jsonld] /nix/store/hvlf3xzdw0p5s3kybdkch6iqyz0740rc-hscolour-1.25/bin/HsColour
  427. 64.25 s [schema-dot-org-jsonld] No jhc found
  428. 64.25 s [schema-dot-org-jsonld] Using ld found on system at:
  429. 64.25 s [schema-dot-org-jsonld] /nix/store/788mx070y81zjlg5ipcl0cra3afviw9k-gcc-wrapper-15.2.0/bin/ld
  430. 64.25 s [schema-dot-org-jsonld] No pkg-config found
  431. 64.25 s [schema-dot-org-jsonld] Using runghc version 9.10.3 found on system at:
  432. 64.25 s [schema-dot-org-jsonld] /nix/store/k493jzz83044mqayvlb6247l35780kxy-ghc-9.10.3/bin/runghc-9.10.3
  433. 64.25 s [schema-dot-org-jsonld] Using strip version 2.46 found on system at:
  434. 64.25 s [schema-dot-org-jsonld] /nix/store/788mx070y81zjlg5ipcl0cra3afviw9k-gcc-wrapper-15.2.0/bin/strip
  435. 64.25 s [schema-dot-org-jsonld] Using tar found on system at:
  436. 64.25 s [schema-dot-org-jsonld] /nix/store/k5akwnrn9x2afaj2va7g4a2zpdim8l43-gnutar-1.35/bin/tar
  437. 64.25 s [schema-dot-org-jsonld] No uhc found
  438. 65.37 s [schema-dot-org-jsonld] Phase: buildPhase
  439. 65.44 s [schema-dot-org-jsonld] Preprocessing library for schema-dot-org-jsonld-0.0.0.0...
  440. 65.44 s [schema-dot-org-jsonld] Building library for schema-dot-org-jsonld-0.0.0.0...
  441. 65.53 s [schema-dot-org-jsonld] [1 of 5] Compiling Paths_schema_dot_org_jsonld ( dist/build/autogen/Paths_schema_dot_org_jsonld.hs, dist/build/Paths_schema_dot_org_jsonld.o, dist/build/Paths_schema_dot_org_jsonld.dyn_o )
  442. 65.67 s [schema-dot-org-jsonld] [2 of 5] Compiling SchemaDotOrg.JSONLD.Parse ( src/SchemaDotOrg/JSONLD/Parse.hs, dist/build/SchemaDotOrg/JSONLD/Parse.o, dist/build/SchemaDotOrg/JSONLD/Parse.dyn_o )
  443. 66.19 s [schema-dot-org-jsonld] [3 of 5] Compiling SchemaDotOrg.JSONLD.Render ( src/SchemaDotOrg/JSONLD/Render.hs, dist/build/SchemaDotOrg/JSONLD/Render.o, dist/build/SchemaDotOrg/JSONLD/Render.dyn_o )
  444. 66.19 s [schema-dot-org-jsonld] [4 of 5] Compiling SchemaDotOrg.JSONLD.Tagsoup ( src/SchemaDotOrg/JSONLD/Tagsoup.hs, dist/build/SchemaDotOrg/JSONLD/Tagsoup.o, dist/build/SchemaDotOrg/JSONLD/Tagsoup.dyn_o )
  445. 66.30 s [schema-dot-org-jsonld] [5 of 5] Compiling SchemaDotOrg.JSONLD ( src/SchemaDotOrg/JSONLD.hs, dist/build/SchemaDotOrg/JSONLD.o, dist/build/SchemaDotOrg/JSONLD.dyn_o )
  446. 66.52 s [schema-dot-org-jsonld] [1 of 5] Compiling Paths_schema_dot_org_jsonld ( dist/build/autogen/Paths_schema_dot_org_jsonld.hs, dist/build/Paths_schema_dot_org_jsonld.p_o )
  447. 66.80 s [schema-dot-org-jsonld] [2 of 5] Compiling SchemaDotOrg.JSONLD.Parse ( src/SchemaDotOrg/JSONLD/Parse.hs, dist/build/SchemaDotOrg/JSONLD/Parse.p_o )
  448. 67.26 s [schema-dot-org-jsonld] [3 of 5] Compiling SchemaDotOrg.JSONLD.Render ( src/SchemaDotOrg/JSONLD/Render.hs, dist/build/SchemaDotOrg/JSONLD/Render.p_o )
  449. 67.26 s [schema-dot-org-jsonld] [4 of 5] Compiling SchemaDotOrg.JSONLD.Tagsoup ( src/SchemaDotOrg/JSONLD/Tagsoup.hs, dist/build/SchemaDotOrg/JSONLD/Tagsoup.p_o )
  450. 67.37 s [schema-dot-org-jsonld] [5 of 5] Compiling SchemaDotOrg.JSONLD ( src/SchemaDotOrg/JSONLD.hs, dist/build/SchemaDotOrg/JSONLD.p_o )
  451. 69.24 s [schema-dot-org-jsonld] Preprocessing test suite 'schema-dot-org-jsonld-test' for schema-dot-org-jsonld-0.0.0.0...
  452. 69.24 s [schema-dot-org-jsonld] Building test suite 'schema-dot-org-jsonld-test' for schema-dot-org-jsonld-0.0.0.0...
  453. 69.34 s [schema-dot-org-jsonld] [1 of 3] Compiling Paths_schema_dot_org_jsonld ( dist/build/schema-dot-org-jsonld-test/autogen/Paths_schema_dot_org_jsonld.hs, dist/build/schema-dot-org-jsonld-test/schema-dot-org-jsonld-test-tmp/Paths_schema_dot_org_jsonld.o )
  454. 69.43 s [schema-dot-org-jsonld] [2 of 3] Compiling SchemaDotOrg.JSONLD.TagsoupSpec ( test/SchemaDotOrg/JSONLD/TagsoupSpec.hs, dist/build/schema-dot-org-jsonld-test/schema-dot-org-jsonld-test-tmp/SchemaDotOrg/JSONLD/TagsoupSpec.o )
  455. 69.50 s [schema-dot-org-jsonld] test/SchemaDotOrg/JSONLD/TagsoupSpec.hs:33:25: error: [GHC-83865]
  456. 69.50 s [schema-dot-org-jsonld] • Couldn't match type: Path.Internal.Posix.Path
  457. 69.50 s [schema-dot-org-jsonld] Path.Posix.Rel Path.Posix.Dir
  458. 69.50 s [schema-dot-org-jsonld] with: [Char]
  459. 69.50 s [schema-dot-org-jsonld] Expected: FilePath
  460. 69.50 s [schema-dot-org-jsonld] Actual: Path.Internal.Posix.Path Path.Posix.Rel Path.Posix.Dir
  461. 69.50 s [schema-dot-org-jsonld] • In the first argument of ‘scenarioDir’, namely
  462. 69.50 s [schema-dot-org-jsonld] ‘(Path.Internal.Posix.Path "test_resources/" ::
  463. 69.50 s [schema-dot-org-jsonld] Path.Internal.Posix.Path Path.Posix.Rel Path.Posix.Dir)’
  464. 69.50 s [schema-dot-org-jsonld] In the first argument of ‘($)’, namely
  465. 69.50 s [schema-dot-org-jsonld] ‘scenarioDir
  466. 69.50 s [schema-dot-org-jsonld] (Path.Internal.Posix.Path "test_resources/" ::
  467. 69.50 s [schema-dot-org-jsonld] Path.Internal.Posix.Path Path.Posix.Rel Path.Posix.Dir)’
  468. 69.50 s [schema-dot-org-jsonld] In the second argument of ‘($)’, namely
  469. 69.50 s [schema-dot-org-jsonld] ‘scenarioDir
  470. 69.50 s [schema-dot-org-jsonld] (Path.Internal.Posix.Path "test_resources/" ::
  471. 69.50 s [schema-dot-org-jsonld] Path.Internal.Posix.Path Path.Posix.Rel Path.Posix.Dir)
  472. 69.50 s [schema-dot-org-jsonld] $ \ file
  473. 69.50 s [schema-dot-org-jsonld] -> when (fileExtension file == Just ".html")
  474. 69.50 s [schema-dot-org-jsonld] $ do let ...
  475. 69.50 s [schema-dot-org-jsonld] it (unwords [...]) $ do ...’
  476. 69.50 s [schema-dot-org-jsonld] |
  477. 69.50 s [schema-dot-org-jsonld] 33 | scenarioDir [reldir|test_resources|] $ \file ->
  478. 69.50 s [schema-dot-org-jsonld] | ^^^^^^^^^^^^^^^^
  479. 69.50 s [schema-dot-org-jsonld]
  480. 69.50 s [schema-dot-org-jsonld] test/SchemaDotOrg/JSONLD/TagsoupSpec.hs:34:27: error: [GHC-83865]
  481. 69.50 s [schema-dot-org-jsonld] • Couldn't match type: [Char]
  482. 69.50 s [schema-dot-org-jsonld] with: Path.Internal.Posix.Path b0 Path.Posix.File
  483. 69.50 s [schema-dot-org-jsonld] Expected: Path.Internal.Posix.Path b0 Path.Posix.File
  484. 69.50 s [schema-dot-org-jsonld] Actual: FilePath
  485. 69.50 s [schema-dot-org-jsonld] • In the first argument of ‘fileExtension’, namely ‘file’
  486. 69.50 s [schema-dot-org-jsonld] In the first argument of ‘(==)’, namely ‘fileExtension file’
  487. 69.50 s [schema-dot-org-jsonld] In the first argument of ‘when’, namely
  488. 69.50 s [schema-dot-org-jsonld] ‘(fileExtension file == Just ".html")’
  489. 69.50 s [schema-dot-org-jsonld] |
  490. 69.50 s [schema-dot-org-jsonld] 34 | when (fileExtension file == Just ".html") $ do
  491. 69.50 s [schema-dot-org-jsonld] | ^^^^
  492. 69.50 s [schema-dot-org-jsonld]
  493. 69.50 s [schema-dot-org-jsonld] test/SchemaDotOrg/JSONLD/TagsoupSpec.hs:35:30: error: [GHC-83865]
  494. 69.50 s [schema-dot-org-jsonld] • Couldn't match type: [Char]
  495. 69.50 s [schema-dot-org-jsonld] with: Path.Internal.Posix.Path Path.Posix.Rel Path.Posix.File
  496. 69.50 s [schema-dot-org-jsonld] Expected: Path.Internal.Posix.Path Path.Posix.Rel Path.Posix.File
  497. 69.50 s [schema-dot-org-jsonld] Actual: FilePath
  498. 69.50 s [schema-dot-org-jsonld] • In the first argument of ‘fromRelFile’, namely ‘file’
  499. 69.50 s [schema-dot-org-jsonld] In the expression: fromRelFile file
  500. 69.50 s [schema-dot-org-jsonld] In an equation for ‘fp’: fp = fromRelFile file
  501. 69.50 s [schema-dot-org-jsonld] |
  502. 69.50 s [schema-dot-org-jsonld] 35 | let fp = fromRelFile file
  503. 69.50 s [schema-dot-org-jsonld] | ^^^^
  504. 69.50 s [schema-dot-org-jsonld]
  505. 69.65 s Progress: 1 of 2 built (1 failed), 40 of 40 downloaded from cache
  506. 69.65 s Failed to build schema-dot-org-jsonld after 8.4s
  507. 69.66 s Cannot build '/nix/store/b7wxkz1av6hmgals5h16625kcxfjpvyg-schema-dot-org-jsonld-0.0.0.0.drv'.
  508. 69.66 s Reason: builder failed with exit code 1.
  509. 69.66 s Output paths:
  510. 69.66 s /nix/store/8q2s09jza1l7wqhq4i0sqrkqmsx0ldiz-schema-dot-org-jsonld-0.0.0.0
  511. 69.66 s /nix/store/nicsxijpgvgpw191gz23d9r192p566w0-schema-dot-org-jsonld-0.0.0.0-doc
  512. 69.66 s Last 209 log lines:
  513. 69.66 s > Running phase: setupCompilerEnvironmentPhase
  514. 69.66 s > Build with /nix/store/k493jzz83044mqayvlb6247l35780kxy-ghc-9.10.3.
  515. 69.66 s > Running phase: unpackPhase
  516. 69.66 s > unpacking source archive /nix/store/9q5dm03axrmxqhm6x7iqpyv5947n8j8l-schema-dot-org-jsonld-source-0.0.0.0/schema-dot-org-jsonld-0.0.0.0.tar.gz
  517. 69.66 s > source root is schema-dot-org-jsonld-0.0.0.0
  518. 69.66 s > setting SOURCE_DATE_EPOCH to timestamp 1788936908 of file "schema-dot-org-jsonld-0.0.0.0/test/Spec.hs"
  519. 69.66 s > warning: file "schema-dot-org-jsonld-0.0.0.0/test/Spec.hs" may be generated; SOURCE_DATE_EPOCH may be non-deterministic
  520. 69.66 s > Running phase: patchPhase
  521. 69.66 s > Running phase: compileBuildDriverPhase
  522. 69.66 s > setupCompileFlags: -package-db=/build/tmp.utuxe2in0F/setup-package.conf.d -threaded
  523. 69.66 s > [1 of 2] Compiling Main ( Setup.hs, /build/tmp.utuxe2in0F/Main.o )
  524. 69.66 s > [2 of 2] Linking Setup
  525. 69.66 s > Running phase: updateAutotoolsGnuConfigScriptsPhase
  526. 69.66 s > Running phase: configurePhase
  527. 69.66 s > configureFlags: --verbose --prefix=/nix/store/8q2s09jza1l7wqhq4i0sqrkqmsx0ldiz-schema-dot-org-jsonld-0.0.0.0 --libdir=$prefix/lib/$compiler/lib --libsubdir=$abi/$libname --docdir=/nix/store/nicsxijpgvgpw191gz23d9r192p566w0-schema-dot-org-jsonld-0.0.0.0-doc/share/doc/schema-dot-org-jsonld-0.0.0.0 --with-gcc=gcc --package-db=/build/tmp.utuxe2in0F/package.conf.d --ghc-option=-j14 --ghc-option=+RTS --ghc-option=-A64M --ghc-option=-RTS --enable-library-profiling --profiling-detail=exported-functions --disable-profiling --enable-shared --disable-coverage --enable-static --disable-executable-dynamic --enable-tests --disable-benchmarks --enable-library-vanilla --disable-library-for-ghci --enable-split-sections --enable-library-stripping --enable-executable-stripping --ghc-option=-haddock --ghc-option=-Wall --ghc-option=-Werror --extra-lib-dirs=/nix/store/wl2nw5l4x4dg6kclbgpq7v9212i1s6cy-ncurses-6.6/lib --extra-lib-dirs=/nix/store/2zs4bbi72plfm8j6zxf1js4f3yc4yzwy-libffi-3.5.2/lib --extra-lib-dirs=/nix/store/qhmqdg27kcrlkl8ida6d5hiacw0y8d21-elfutils-0.194/lib --extra-lib-dirs=/nix/store/y56aqb1m3y5davn6hsv4jfbml78qw4mv-gmp-with-cxx-6.3.0/lib --extra-lib-dirs=/nix/store/wjfhh11sfcdf97mvg7hbxickybxzk850-numactl-2.0.18/lib
  528. 69.66 s > Using Parsec parser
  529. 69.66 s > Configuring schema-dot-org-jsonld-0.0.0.0...
  530. 69.66 s > Dependency aeson: using aeson-2.2.4.1
  531. 69.66 s > Dependency base >=4.7 && <5: using base-4.20.2.0
  532. 69.66 s > Dependency bytestring: using bytestring-0.12.2.0
  533. 69.66 s > Dependency schema-dot-org: using schema-dot-org-0.0.0.0
  534. 69.66 s > Dependency tagsoup: using tagsoup-0.14.8
  535. 69.66 s > Dependency text: using text-2.1.3
  536. 69.66 s > Dependency vector: using vector-0.13.2.0
  537. 69.66 s > Dependency aeson: using aeson-2.2.4.1
  538. 69.66 s > Dependency base >=4.7 && <5: using base-4.20.2.0
  539. 69.66 s > Dependency bytestring: using bytestring-0.12.2.0
  540. 69.66 s > Dependency path: using path-0.9.6
  541. 69.66 s > Dependency schema-dot-org-jsonld: using schema-dot-org-jsonld-0.0.0.0
  542. 69.66 s > Dependency sydtest: using sydtest-0.20.0.1
  543. 69.66 s > Dependency sydtest-aeson: using sydtest-aeson-0.2.0.1
  544. 69.66 s > Source component graph:
  545. 69.66 s > component lib
  546. 69.66 s > component test:schema-dot-org-jsonld-test dependency lib
  547. 69.66 s > Configured component graph:
  548. 69.66 s > component schema-dot-org-jsonld-0.0.0.0-IFXBqy7zHoeF7tncdo1uxB
  549. 69.66 s > include aeson-2.2.4.1-I5kgiCyiPJO8jEV0bEgUez
  550. 69.66 s > include base-4.20.2.0-4d66
  551. 69.66 s > include bytestring-0.12.2.0-25ef
  552. 69.66 s > include schema-dot-org-0.0.0.0-DK3bNdhkDmvFOAaebGqsq5
  553. 69.66 s > include tagsoup-0.14.8-BsqbPSEZh9W5mB1CzgSWho
  554. 69.66 s > include text-2.1.3-3f03
  555. 69.66 s > include vector-0.13.2.0-4sNODSde54Y5T3xVFmV0fE
  556. 69.66 s > component schema-dot-org-jsonld-0.0.0.0-Cu5ewoR91fM6pMI6cAFpDW-schema-dot-org-jsonld-test
  557. 69.66 s > include aeson-2.2.4.1-I5kgiCyiPJO8jEV0bEgUez
  558. 69.66 s > include base-4.20.2.0-4d66
  559. 69.66 s > include bytestring-0.12.2.0-25ef
  560. 69.66 s > include path-0.9.6-L3t3TcndY3P7bshtU9371n
  561. 69.66 s > include schema-dot-org-jsonld-0.0.0.0-IFXBqy7zHoeF7tncdo1uxB
  562. 69.66 s > include sydtest-0.20.0.1-Jo2KtBwwg0M2hH86LVxxcs
  563. 69.66 s > include sydtest-aeson-0.2.0.1-AEtebtKhgEIKIZK2rvdpfT
  564. 69.66 s > Linked component graph:
  565. 69.66 s > unit schema-dot-org-jsonld-0.0.0.0-IFXBqy7zHoeF7tncdo1uxB
  566. 69.66 s > include aeson-2.2.4.1-I5kgiCyiPJO8jEV0bEgUez
  567. 69.66 s > include base-4.20.2.0-4d66
  568. 69.66 s > include bytestring-0.12.2.0-25ef
  569. 69.66 s > include schema-dot-org-0.0.0.0-DK3bNdhkDmvFOAaebGqsq5
  570. 69.66 s > include tagsoup-0.14.8-BsqbPSEZh9W5mB1CzgSWho
  571. 69.66 s > include text-2.1.3-3f03
  572. 69.66 s > include vector-0.13.2.0-4sNODSde54Y5T3xVFmV0fE
  573. 69.66 s > SchemaDotOrg.JSONLD=schema-dot-org-jsonld-0.0.0.0-IFXBqy7zHoeF7tncdo1uxB:SchemaDotOrg.JSONLD,SchemaDotOrg.JSONLD.Parse=schema-dot-org-jsonld-0.0.0.0-IFXBqy7zHoeF7tncdo1uxB:SchemaDotOrg.JSONLD.Parse,SchemaDotOrg.JSONLD.Render=schema-dot-org-jsonld-0.0.0.0-IFXBqy7zHoeF7tncdo1uxB:SchemaDotOrg.JSONLD.Render,SchemaDotOrg.JSONLD.Tagsoup=schema-dot-org-jsonld-0.0.0.0-IFXBqy7zHoeF7tncdo1uxB:SchemaDotOrg.JSONLD.Tagsoup
  574. 69.66 s > unit schema-dot-org-jsonld-0.0.0.0-Cu5ewoR91fM6pMI6cAFpDW-schema-dot-org-jsonld-test
  575. 69.66 s > include aeson-2.2.4.1-I5kgiCyiPJO8jEV0bEgUez
  576. 69.66 s > include base-4.20.2.0-4d66
  577. 69.66 s > include bytestring-0.12.2.0-25ef
  578. 69.66 s > include path-0.9.6-L3t3TcndY3P7bshtU9371n
  579. 69.66 s > include schema-dot-org-jsonld-0.0.0.0-IFXBqy7zHoeF7tncdo1uxB
  580. 69.66 s > include sydtest-0.20.0.1-Jo2KtBwwg0M2hH86LVxxcs
  581. 69.66 s > include sydtest-aeson-0.2.0.1-AEtebtKhgEIKIZK2rvdpfT
  582. 69.66 s > Ready component graph:
  583. 69.66 s > definite schema-dot-org-jsonld-0.0.0.0-IFXBqy7zHoeF7tncdo1uxB
  584. 69.66 s > depends aeson-2.2.4.1-I5kgiCyiPJO8jEV0bEgUez
  585. 69.66 s > depends base-4.20.2.0-4d66
  586. 69.66 s > depends bytestring-0.12.2.0-25ef
  587. 69.66 s > depends schema-dot-org-0.0.0.0-DK3bNdhkDmvFOAaebGqsq5
  588. 69.66 s > depends tagsoup-0.14.8-BsqbPSEZh9W5mB1CzgSWho
  589. 69.66 s > depends text-2.1.3-3f03
  590. 69.66 s > depends vector-0.13.2.0-4sNODSde54Y5T3xVFmV0fE
  591. 69.66 s > definite schema-dot-org-jsonld-0.0.0.0-Cu5ewoR91fM6pMI6cAFpDW-schema-dot-org-jsonld-test
  592. 69.66 s > depends aeson-2.2.4.1-I5kgiCyiPJO8jEV0bEgUez
  593. 69.66 s > depends base-4.20.2.0-4d66
  594. 69.66 s > depends bytestring-0.12.2.0-25ef
  595. 69.66 s > depends path-0.9.6-L3t3TcndY3P7bshtU9371n
  596. 69.66 s > depends schema-dot-org-jsonld-0.0.0.0-IFXBqy7zHoeF7tncdo1uxB
  597. 69.66 s > depends sydtest-0.20.0.1-Jo2KtBwwg0M2hH86LVxxcs
  598. 69.66 s > depends sydtest-aeson-0.2.0.1-AEtebtKhgEIKIZK2rvdpfT
  599. 69.66 s > Using Cabal-3.12.1.0 compiled by ghc-9.10
  600. 69.66 s > Using compiler: ghc-9.10.3
  601. 69.66 s > Using install prefix:
  602. 69.66 s > /nix/store/8q2s09jza1l7wqhq4i0sqrkqmsx0ldiz-schema-dot-org-jsonld-0.0.0.0
  603. 69.66 s > Executables installed in:
  604. 69.66 s > /nix/store/8q2s09jza1l7wqhq4i0sqrkqmsx0ldiz-schema-dot-org-jsonld-0.0.0.0/bin
  605. 69.66 s > Libraries installed in:
  606. 69.66 s > /nix/store/8q2s09jza1l7wqhq4i0sqrkqmsx0ldiz-schema-dot-org-jsonld-0.0.0.0/lib/ghc-9.10.3/lib/x86_64-linux-ghc-9.10.3-21af/schema-dot-org-jsonld-0.0.0.0-IFXBqy7zHoeF7tncdo1uxB
  607. 69.66 s > Dynamic Libraries installed in:
  608. 69.66 s > /nix/store/8q2s09jza1l7wqhq4i0sqrkqmsx0ldiz-schema-dot-org-jsonld-0.0.0.0/lib/ghc-9.10.3/lib/x86_64-linux-ghc-9.10.3-21af
  609. 69.66 s > Private executables installed in:
  610. 69.66 s > /nix/store/8q2s09jza1l7wqhq4i0sqrkqmsx0ldiz-schema-dot-org-jsonld-0.0.0.0/libexec/x86_64-linux-ghc-9.10.3-21af/schema-dot-org-jsonld-0.0.0.0
  611. 69.66 s > Data files installed in:
  612. 69.66 s > /nix/store/8q2s09jza1l7wqhq4i0sqrkqmsx0ldiz-schema-dot-org-jsonld-0.0.0.0/share/x86_64-linux-ghc-9.10.3-21af/schema-dot-org-jsonld-0.0.0.0
  613. 69.66 s > Documentation installed in:
  614. 69.66 s > /nix/store/nicsxijpgvgpw191gz23d9r192p566w0-schema-dot-org-jsonld-0.0.0.0-doc/share/doc/schema-dot-org-jsonld-0.0.0.0
  615. 69.66 s > Configuration files installed in:
  616. 69.66 s > /nix/store/8q2s09jza1l7wqhq4i0sqrkqmsx0ldiz-schema-dot-org-jsonld-0.0.0.0/etc
  617. 69.66 s > No alex found
  618. 69.66 s > Using ar found on system at:
  619. 69.66 s > /nix/store/mbyy19mdwnfvfwmdi0gqgggx0njvpl1w-binutils-wrapper-2.46/bin/ar
  620. 69.66 s > No c2hs found
  621. 69.66 s > No cpphs found
  622. 69.66 s > No doctest found
  623. 69.66 s > Using gcc version 15.2.0 given by user at:
  624. 69.66 s > /nix/store/788mx070y81zjlg5ipcl0cra3afviw9k-gcc-wrapper-15.2.0/bin/gcc
  625. 69.66 s > Using ghc version 9.10.3 found on system at:
  626. 69.66 s > /nix/store/k493jzz83044mqayvlb6247l35780kxy-ghc-9.10.3/bin/ghc
  627. 69.66 s > Using ghc-pkg version 9.10.3 found on system at:
  628. 69.66 s > /nix/store/k493jzz83044mqayvlb6247l35780kxy-ghc-9.10.3/bin/ghc-pkg-9.10.3
  629. 69.66 s > No ghcjs found
  630. 69.66 s > No ghcjs-pkg found
  631. 69.66 s > No greencard found
  632. 69.66 s > Using haddock version 2.31.1 found on system at:
  633. 69.66 s > /nix/store/k493jzz83044mqayvlb6247l35780kxy-ghc-9.10.3/bin/haddock-ghc-9.10.3
  634. 69.66 s > No happy found
  635. 69.66 s > Using haskell-suite found on system at: haskell-suite-dummy-location
  636. 69.66 s > Using haskell-suite-pkg found on system at: haskell-suite-pkg-dummy-location
  637. 69.66 s > No hmake found
  638. 69.66 s > Using hpc version 0.69 found on system at:
  639. 69.66 s > /nix/store/k493jzz83044mqayvlb6247l35780kxy-ghc-9.10.3/bin/hpc-ghc-9.10.3
  640. 69.66 s > Using hsc2hs version 0.68.10 found on system at:
  641. 69.66 s > /nix/store/k493jzz83044mqayvlb6247l35780kxy-ghc-9.10.3/bin/hsc2hs-ghc-9.10.3
  642. 69.66 s > Using hscolour version 1.25 found on system at:
  643. 69.66 s > /nix/store/hvlf3xzdw0p5s3kybdkch6iqyz0740rc-hscolour-1.25/bin/HsColour
  644. 69.66 s > No jhc found
  645. 69.66 s > Using ld found on system at:
  646. 69.66 s > /nix/store/788mx070y81zjlg5ipcl0cra3afviw9k-gcc-wrapper-15.2.0/bin/ld
  647. 69.66 s > No pkg-config found
  648. 69.66 s > Using runghc version 9.10.3 found on system at:
  649. 69.66 s > /nix/store/k493jzz83044mqayvlb6247l35780kxy-ghc-9.10.3/bin/runghc-9.10.3
  650. 69.66 s > Using strip version 2.46 found on system at:
  651. 69.66 s > /nix/store/788mx070y81zjlg5ipcl0cra3afviw9k-gcc-wrapper-15.2.0/bin/strip
  652. 69.66 s > Using tar found on system at:
  653. 69.66 s > /nix/store/k5akwnrn9x2afaj2va7g4a2zpdim8l43-gnutar-1.35/bin/tar
  654. 69.66 s > No uhc found
  655. 69.66 s > Running phase: buildPhase
  656. 69.66 s > Preprocessing library for schema-dot-org-jsonld-0.0.0.0...
  657. 69.66 s > Building library for schema-dot-org-jsonld-0.0.0.0...
  658. 69.66 s > [1 of 5] Compiling Paths_schema_dot_org_jsonld ( dist/build/autogen/Paths_schema_dot_org_jsonld.hs, dist/build/Paths_schema_dot_org_jsonld.o, dist/build/Paths_schema_dot_org_jsonld.dyn_o )
  659. 69.66 s > [2 of 5] Compiling SchemaDotOrg.JSONLD.Parse ( src/SchemaDotOrg/JSONLD/Parse.hs, dist/build/SchemaDotOrg/JSONLD/Parse.o, dist/build/SchemaDotOrg/JSONLD/Parse.dyn_o )
  660. 69.66 s > [3 of 5] Compiling SchemaDotOrg.JSONLD.Render ( src/SchemaDotOrg/JSONLD/Render.hs, dist/build/SchemaDotOrg/JSONLD/Render.o, dist/build/SchemaDotOrg/JSONLD/Render.dyn_o )
  661. 69.66 s > [4 of 5] Compiling SchemaDotOrg.JSONLD.Tagsoup ( src/SchemaDotOrg/JSONLD/Tagsoup.hs, dist/build/SchemaDotOrg/JSONLD/Tagsoup.o, dist/build/SchemaDotOrg/JSONLD/Tagsoup.dyn_o )
  662. 69.66 s > [5 of 5] Compiling SchemaDotOrg.JSONLD ( src/SchemaDotOrg/JSONLD.hs, dist/build/SchemaDotOrg/JSONLD.o, dist/build/SchemaDotOrg/JSONLD.dyn_o )
  663. 69.66 s > [1 of 5] Compiling Paths_schema_dot_org_jsonld ( dist/build/autogen/Paths_schema_dot_org_jsonld.hs, dist/build/Paths_schema_dot_org_jsonld.p_o )
  664. 69.66 s > [2 of 5] Compiling SchemaDotOrg.JSONLD.Parse ( src/SchemaDotOrg/JSONLD/Parse.hs, dist/build/SchemaDotOrg/JSONLD/Parse.p_o )
  665. 69.66 s > [3 of 5] Compiling SchemaDotOrg.JSONLD.Render ( src/SchemaDotOrg/JSONLD/Render.hs, dist/build/SchemaDotOrg/JSONLD/Render.p_o )
  666. 69.66 s > [4 of 5] Compiling SchemaDotOrg.JSONLD.Tagsoup ( src/SchemaDotOrg/JSONLD/Tagsoup.hs, dist/build/SchemaDotOrg/JSONLD/Tagsoup.p_o )
  667. 69.66 s > [5 of 5] Compiling SchemaDotOrg.JSONLD ( src/SchemaDotOrg/JSONLD.hs, dist/build/SchemaDotOrg/JSONLD.p_o )
  668. 69.66 s > Preprocessing test suite 'schema-dot-org-jsonld-test' for schema-dot-org-jsonld-0.0.0.0...
  669. 69.66 s > Building test suite 'schema-dot-org-jsonld-test' for schema-dot-org-jsonld-0.0.0.0...
  670. 69.66 s > [1 of 3] Compiling Paths_schema_dot_org_jsonld ( dist/build/schema-dot-org-jsonld-test/autogen/Paths_schema_dot_org_jsonld.hs, dist/build/schema-dot-org-jsonld-test/schema-dot-org-jsonld-test-tmp/Paths_schema_dot_org_jsonld.o )
  671. 69.66 s > [2 of 3] Compiling SchemaDotOrg.JSONLD.TagsoupSpec ( test/SchemaDotOrg/JSONLD/TagsoupSpec.hs, dist/build/schema-dot-org-jsonld-test/schema-dot-org-jsonld-test-tmp/SchemaDotOrg/JSONLD/TagsoupSpec.o )
  672. 69.66 s > test/SchemaDotOrg/JSONLD/TagsoupSpec.hs:33:25: error: [GHC-83865]
  673. 69.66 s > • Couldn't match type: Path.Internal.Posix.Path
  674. 69.66 s > Path.Posix.Rel Path.Posix.Dir
  675. 69.66 s > with: [Char]
  676. 69.66 s > Expected: FilePath
  677. 69.66 s > Actual: Path.Internal.Posix.Path Path.Posix.Rel Path.Posix.Dir
  678. 69.66 s > • In the first argument of ‘scenarioDir’, namely
  679. 69.66 s > ‘(Path.Internal.Posix.Path "test_resources/" ::
  680. 69.66 s > Path.Internal.Posix.Path Path.Posix.Rel Path.Posix.Dir)’
  681. 69.66 s > In the first argument of ‘($)’, namely
  682. 69.66 s > ‘scenarioDir
  683. 69.66 s > (Path.Internal.Posix.Path "test_resources/" ::
  684. 69.66 s > Path.Internal.Posix.Path Path.Posix.Rel Path.Posix.Dir)’
  685. 69.66 s > In the second argument of ‘($)’, namely
  686. 69.66 s > ‘scenarioDir
  687. 69.66 s > (Path.Internal.Posix.Path "test_resources/" ::
  688. 69.66 s > Path.Internal.Posix.Path Path.Posix.Rel Path.Posix.Dir)
  689. 69.66 s > $ \ file
  690. 69.66 s > -> when (fileExtension file == Just ".html")
  691. 69.66 s > $ do let ...
  692. 69.66 s > it (unwords [...]) $ do ...’
  693. 69.66 s > |
  694. 69.66 s > 33 | scenarioDir [reldir|test_resources|] $ \file ->
  695. 69.66 s > | ^^^^^^^^^^^^^^^^
  696. 69.66 s >
  697. 69.66 s > test/SchemaDotOrg/JSONLD/TagsoupSpec.hs:34:27: error: [GHC-83865]
  698. 69.66 s > • Couldn't match type: [Char]
  699. 69.66 s > with: Path.Internal.Posix.Path b0 Path.Posix.File
  700. 69.66 s > Expected: Path.Internal.Posix.Path b0 Path.Posix.File
  701. 69.66 s > Actual: FilePath
  702. 69.66 s > • In the first argument of ‘fileExtension’, namely ‘file’
  703. 69.66 s > In the first argument of ‘(==)’, namely ‘fileExtension file’
  704. 69.66 s > In the first argument of ‘when’, namely
  705. 69.66 s > ‘(fileExtension file == Just ".html")’
  706. 69.66 s > |
  707. 69.66 s > 34 | when (fileExtension file == Just ".html") $ do
  708. 69.66 s > | ^^^^
  709. 69.66 s >
  710. 69.66 s > test/SchemaDotOrg/JSONLD/TagsoupSpec.hs:35:30: error: [GHC-83865]
  711. 69.66 s > • Couldn't match type: [Char]
  712. 69.66 s > with: Path.Internal.Posix.Path Path.Posix.Rel Path.Posix.File
  713. 69.66 s > Expected: Path.Internal.Posix.Path Path.Posix.Rel Path.Posix.File
  714. 69.66 s > Actual: FilePath
  715. 69.66 s > • In the first argument of ‘fromRelFile’, namely ‘file’
  716. 69.66 s > In the expression: fromRelFile file
  717. 69.66 s > In an equation for ‘fp’: fp = fromRelFile file
  718. 69.66 s > |
  719. 69.66 s > 35 | let fp = fromRelFile file
  720. 69.66 s > | ^^^^
  721. 69.66 s >
  722. 69.66 s For full logs, run:
  723. 69.66 s nix log /nix/store/b7wxkz1av6hmgals5h16625kcxfjpvyg-schema-dot-org-jsonld-0.0.0.0.drv
  724. 69.69 s Build failed.